Peptide,PTM,ModifiedAA,ModifiedPosition,PeptideUniqueToGene,ExperimentDesc,ExpID,PubmedID,ScoreType,IdentScore,LocProb,Log2FChange,PQ-val,QuantSig,PEP,MassErrorPPM
SRGNFQNFEDPTQR,me1,R,5,true,"Arabidopsis protein methylome",123,31809900,"MaxQuant Score",76.7590000,1.0000000,,,,2.3660500119149E-6,0.0432860
EQCLEHYR,so,C,140,true,"Arabidopsis S-sulfenylation chemoproteomics",108,31578252,"pFind PSM Score",0.3240400,,,,,,-1.2479793
EQNMKEEYPFSPPK,ph,S,194,true,"atm and atr DNA damage response",88,25561503,"MASCOT Score",23.0000000,1.0000000,,,,,-1.0000000
EEYPFSPPK,ph,S,194,true,"srk2dei ABA signaling phopshoproteomics",83,23572148,"MASCOT Score",31.0000000,,,,,,0.0021000
EEYPFSPPK,ph,S,194,true,"atm and atr DNA damage response",88,25561503,"MASCOT Score",48.0000000,1.0000000,,,,,1.6200000
EEYPFSPPK,ph,S,194,true,"Tissue atlas Arabidopsis - ProteomicsDB",114,32188942,"MaxQuant score",113.4600000,1.0000000,,,,3.0408800739679E-5,
VKVEDTQKESFVDR,sumo,K,199,true,"SUMO Ligase SIZ1 heat stress",4,29588388,,,,,,,,
VEDTQKESFVDR,ac,K,205,true,"Histone deacetylases - apicidin vs control",98a,29061669,"MaxQuant Score",69.0000000,1.0000000,-0.0920000,0.6776415,NO,0.0040000001899898,
VEDTQKESFVDR,ac,K,205,true,"Histone deacetylases- hda14 vs WT (low light)",98c,29061669,"MaxQuant Score",142.3800000,1.0000000,-0.0690000,0.9931160,NO,2.3000000510365E-5,
SFGGKKPVSTSVNNSLVELSNYNQK,ac,K,216,true,"Histone deacetylases- hda14 vs WT (low light)",98c,29061669,"MaxQuant Score",150.0300000,1.0000000,-0.1410000,0.9885531,NO,3.3000001284378E-16,
SFGGKKPVSTSVNNSLVELSNYNQK,ac,K,216,true,"Histone deacetylases substrates - hda14 vs WT",98e,29061669,"MaxQuant Score",59.9000000,1.0000000,0.0450000,0.9506048,NO,1.6999999843392E-6,
SFGGKKPVSTSVNNSLVELSNYNQK,ac,K,217,true,"Histone deacetylases- hda14 vs WT (low light)",98c,29061669,"MaxQuant Score",150.0300000,1.0000000,-0.1410000,0.9885531,NO,3.3000001284378E-16,
SFGGKKPVSTSVNNSLVELSNYNQK,ac,K,217,true,"Histone deacetylases substrates - hda14 vs WT",98e,29061669,"MaxQuant Score",59.9000000,1.0000000,0.0450000,0.9506048,NO,1.6999999843392E-6,
DPTKVDR,ac,K,471,false,"Quantitative Acetylproteomics",101,29440448,,,,,,,,
