Peptide,PTM,ModifiedAA,ModifiedPosition,PeptideUniqueToGene,ExperimentDesc,ExpID,PubmedID,ScoreType,IdentScore,LocProb,Log2FChange,PQ-val,QuantSig,PEP,MassErrorPPM
MDQTVSENLIQVK,nta,M,1,true,"Characterization plant N-terminal acetylation",6,22223895,"MASCOT Score",82.8000000,,,,,,
SGVDLTAAE,nt,S,68,true,"Arg/N-end rule seed, prt6 vs. Wt",99,29168982,"MASCOT Score",38.1200000,,0.0569222,0.7144720,NO,0.030540000647306,-0.3910964
GVDLTAAE,nt,G,69,true,"Arg/N-end rule seed, prt6 vs. Wt",99,29168982,"MASCOT Score",42.7700000,,-0.3841191,0.1209907,NO,0.037650000303984,0.1692130
DILVASR,nt,D,121,true,"Arg/N-end rule seed, prt6 vs. Wt",99,29168982,"MASCOT Score",28.3800000,,0.0524580,0.7559040,NO,0.21289999783039,-1.0386313
IKSVINDGLK,ac,K,212,true,"Quantitative Acetylproteomics",101,29440448,,,,,,,,
ALTLEK,ph,T,228,false,"srk2dei ABA signaling phopshoproteomics",83,23572148,"MASCOT Score",34.0000000,,,,,,-0.0002000
ALTLEK,ph,T,228,false,"SnRK2 protein kinase substrates",85,23776212,XCorr,2.3295858,1.0000000,,,,0.19464200735092,
ALTLEK,ph,T,228,false,"TOR Kinase and ABA Receptor",100,29290610,XCorr,2.6361542,1.0000000,,,,0.0077860001474619,
LDLGHALTLEKER,ac,K,231,true,"Quantitative Acetylproteomics",101,29440448,,,,,,,,
ERAHAYYSGMTK,mox,M,241,true,"cat2 Methionine oxidation - 3h stress",62b,25693801,"MASCOT Score",59.0000000,,-0.1269865,,NO,,
GSKKPSSKL,ph,S,263,true,"srk2dei ABA signaling phopshoproteomics",83,23572148,"MASCOT Score",24.0000000,,,,,,-0.0009000
