Peptide,PTM,ModifiedAA,ModifiedPosition,PeptideUniqueToGene,ExperimentDesc,ExpID,PubmedID,ScoreType,IdentScore,LocProb,Log2FChange,PQ-val,QuantSig,PEP,MassErrorPPM
STVISGEVTDGFVNPIR,nt,S,21,true,"Arg/N-end rule seed, prt6 vs. Wt",99,29168982,"MASCOT Score",61.5800000,,-0.6550962,0.2172684,NO,0.0060290000401437,-1.5615071
STVISGEVTDGFVNPIR,nt,S,21,true,"HUNTER N-terminome: legumain, GluC and trypsin",119,31951383,"MaxQuant score",87.4980000,,,,,,
LPTDTQTAPILPTSDLPTEFDWR,nt,L,125,true,"FtsH12 N-terminome: WT / FtsH12 knockdown miRNA",118,33216923,"MaxQuant score",57.6480000,,,,,3.4500000765547E-5,
LPTDTQTAPILPTSDLPTEFDWR,nt,L,125,true,"HUNTER N-terminome: legumain, GluC and trypsin",119,31951383,"MaxQuant score",55.5880000,,,,,,
LPTDTQTAPILPTSDLPTE,nt,L,125,true,"Arg/N-end rule seed, prt6 vs. Wt",99,29168982,"MASCOT Score",39.8700000,,-0.2334984,0.2700014,NO,2.686000044605E-8,-1.2513025
LPTDTQTAPILPTSDLPTE,nt,L,125,true,"HUNTER N-terminome: legumain, GluC and trypsin",119,31951383,"MaxQuant score",94.1220000,,,,,,
SDLPTEFDWR,nta,S,138,true,"FtsH12 N-terminome: WT / FtsH12 knockdown miRNA",118,33216923,"MaxQuant score",52.7840000,,,,,0.0089752003550529,
DHTACK,sno,C,245,true,"hot5-4 / wildtype, FAT-switch S-nitrosoproteome",169,37277371,,,,0.5167930,0.0014365,NO,,
