Peptide,PTM,ModifiedAA,ModifiedPosition,PeptideUniqueToGene,ExperimentDesc,ExpID,PubmedID,ScoreType,IdentScore,LocProb,Log2FChange,PQ-val,QuantSig,PEP,MassErrorPPM
AASSSAGNGAPSKSFDYD,nt,A,69,true,"HUNTER N-terminome: legumain, GluC and trypsin",119,31951383,"MaxQuant score",136.1700000,,,,,,
AASSSAGNGAPSKSFDYD,nta,A,69,true,"HUNTER N-terminome: legumain, GluC and trypsin",119,31951383,"MaxQuant score",56.9560000,,,,,,
ASSSAGNGAPSKSFDYD,nt,A,70,true,"HUNTER N-terminome: legumain, GluC and trypsin",119,31951383,"MaxQuant score",86.9440000,,,,,,
TAIIEGDVVGGTCVNR,acy,C,122,false,"Arabidopsis S-acylation atlas - Meristem",163a,35681017,,,,,,,,
TAIIEGDVVGGTCVNR,ox,C,122,false,"Redox kickstart of mitochondria",112,31871212,,,,-0.5129457,0.0000088,YES,,
TAIIEGDVVGGTCVNR,sno,C,122,false,"Site-specific nitrosomeproteomic id - gsnor1-3",90a,25699590,XCorr,4.3728089,,,,,0.040890000760555,-6.9545953
TAIIEGDVVGGTCVNR,sno,C,122,false,"Site-specific nitrosomeproteomic id - gsnor1-3",90b,25699590,XCorr,4.8300000,,,,,0.0056819999590516,-6.7200000
TAIIEGDVVGGTCVNR,sno,C,122,false,"hot5-4 / wildtype, FAT-switch S-nitrosoproteome",169,37277371,,,,,,,,
GCVPSK,ox,C,127,false,"OxiTRAQ Arabidopsis - 5 mM H2O2 versus control",47,24376095,,,,-0.0950833,0.3795106,NO,,
GCVPSK,sno,C,127,false,"hot5-4 / wildtype, FAT-switch S-nitrosoproteome",169,37277371,,,,,,,,
QGVADHASNLATKIR,nt,Q,164,true,"HUNTER N-terminome: legumain, GluC and trypsin",119,31951383,"MaxQuant score",82.2590000,,,,,,
QGVADHASNLATKIR,ac,K,176,true,"Histone deacetylases- hda14 vs WT (low light)",98c,29061669,"MaxQuant Score",149.3100000,1.0000000,0.3440000,0.9885531,NO,4.2000000699538E-10,
QGVADHASNLATKIR,ac,K,176,true,"Histone deacetylases - hda14 vs WT (thylakoids)",98d,29061669,"MaxQuant Score",92.8000000,1.0000000,0.1350000,0.9862795,NO,3.5600000725111E-9,
QGVADHASNLATKIR,ac,K,176,true,"Quantitative Acetylproteomics",101,29440448,,,,,,,,
IRNNLTNSMK,mox,M,185,false,"cat2 Methionine oxidation - 1h stress",62a,25693801,"MASCOT Score",38.0000000,,0.2584817,,NO,,
VKYGDNIITGK,ac,K,206,true,"Histone deacetylases substrates - hda14 vs WT",98e,29061669,"MaxQuant Score",65.2000000,1.0000000,0.0580000,0.9289664,NO,0.0010000000474975,
DIIIATGSVPFVPKGIEVDGK,ac,K,229,false,"Histone deacetylases - apicidin vs control",98a,29061669,"MaxQuant Score",143.6000000,1.0000000,-0.2850000,0.2877398,NO,1.1000052815103E-40,
DIIIATGSVPFVPKGIEVDGK,ac,K,229,false,"Histone deacetylases substrates - hda14 vs WT",98e,29061669,"MaxQuant Score",144.3000000,1.0000000,-0.3280000,0.9099133,NO,0,
KIDYHTGVFASK,ac,K,307,false,"Histone deacetylases - apicidin vs control",98a,29061669,"MaxQuant Score",83.2000000,1.0000000,-0.1590000,0.5176068,NO,1.3000000080865E-6,
DYHTGVFASKITPAK,nt,D,309,true,"Arabidopsis translation initiation landscape - NT",167b,35069635,,,,,,,,
AALIATGR,nta,A,348,false,"HUNTER N-terminome: legumain, GluC and trypsin",119,31951383,"MaxQuant score",76.8470000,,,,,,
VSIAKTSFK,ac,K,469,true,"Histone deacetylases - apicidin vs control",98a,29061669,"MaxQuant Score",83.9000000,1.0000000,0.1060000,0.6039486,NO,0.012000000104308,
VSIAKTSFK,ac,K,469,true,"Quantitative Acetylproteomics",101,29440448,,,,,,,,
TSFKANTK,ac,K,473,false,"Histone deacetylases substrates - TSA vs control",98b,29061669,"MaxQuant Score",106.2000000,1.0000000,-0.0440000,0.9977001,NO,0.0070000002160668,
TSFKANTK,ac,K,473,false,"Histone deacetylases- hda14 vs WT (low light)",98c,29061669,"MaxQuant Score",128.2800000,1.0000000,-2.8600000,0.9885531,NO,0.034000001847744,
TSFKANTK,ac,K,473,false,"Quantitative Acetylproteomics",101,29440448,,,,,,,,
LAVHAHPTLSEVVDELFKAAK,ac,K,548,true,"Histone deacetylases substrates - TSA vs control",98b,29061669,"MaxQuant Score",190.2000000,1.0000000,-0.2160000,0.9794900,NO,0,
AAKVDSPASVTAQSVK,ac,K,551,true,"Quantitative Acetylproteomics",101,29440448,,,,,,,,
