Peptide,PTM,ModifiedAA,ModifiedPosition,PeptideUniqueToGene,ExperimentDesc,ExpID,PubmedID,ScoreType,IdentScore,LocProb,Log2FChange,PQ-val,QuantSig,PEP,MassErrorPPM
AFFDSADWALLKQEASIDQR,ph,S,48,true,"Chloroplast kinase substrates",60,19376835,"MASCOT Score",80.5500000,,,,,,-2.7818100
RAFFDSADWALLK,ph,S,48,true,"Chloroplast kinase substrates",60,19376835,"MASCOT Score",59.4400000,,,,,,-0.7233490
RAFFDSADWALLK,ph,S,48,true,"TOR Kinase and ABA Receptor",100,29290610,XCorr,4.9009857,1.0000000,,,,7.2779999754857E-5,
AFFDSADWALLK,ph,S,48,true,"STN8 phosphoproteome",38,21768351,"MASCOT Score",85.6900000,,,,,,-1.6272500
AFFDSADWALLK,ph,S,48,true,"Tyrosine phosphorylation in Arabidopsis",59,18463617,"MASCOT Score",58.0000000,,,,,,-0.7520585
AFFDSADWALLK,ph,S,48,true,"Chloroplast kinase substrates",60,19376835,"MASCOT Score",83.4700000,,,,,,-0.9308470
AFFDSADWALLK,ph,S,48,true,"TOR Kinase and ABA Receptor",100,29290610,XCorr,4.3872375,1.0000000,,,,1.2030000107188E-5,
AFFDSADWALLK,ph,S,48,true,"Lateral root-induction - NAA vs control",106,23328941,"MASCOT Score",34.0000000,,,,,,
AFFDSADWALLK,ph,S,48,true,"Phospho cell culture sucrose/TOR",109,30833711,,,1.0000000,,,,,
AFFDSADWALLK,ph,S,48,true,"Tissue atlas Arabidopsis - ProteomicsDB",114,32188942,"MaxQuant score",125.0300000,1.0000000,,,,9.3976295829634E-6,
AFFDSADWALLK,ph,S,48,true,"Touch-induced phosphorylation: 40s touch vs untouc",136,30291188,"MASCOT score",66.0200000,,-0.1258604,0.0293382,NO,,-0.2616453
RPTCATGNENLTESSF,ph,S,101,true,"Tissue atlas Arabidopsis - ProteomicsDB",114,32188942,"MaxQuant score",79.8100000,0.8753630,,,,0.00024815599317662,
