Peptide,PTM,ModifiedAA,ModifiedPosition,PeptideUniqueToGene,ExperimentDesc,ExpID,PubmedID,ScoreType,IdentScore,LocProb,Log2FChange,PQ-val,QuantSig,PEP,MassErrorPPM
SLRPNAKTEVR,nt,S,2,false,"N-terminal ChaFRADIC",92,26010716,"MASCOT Score",56.0100000,,,,,0.0028750000055879,
SLRPNAKTEVR,nta,S,2,false,"N-terminal ChaFRADIC",92,26010716,"MASCOT Score",56.0100000,,,,,0.0028750000055879,
SLRPNAKTEVR,nta,S,2,false,"Arabidopsis translation initiation landscape - NTA",167a,35069635,,,,,,,,
SLRPNAK,ph,S,2,false,"Tissue atlas Arabidopsis - ProteomicsDB",114,32188942,"MaxQuant score",82.2790000,1.0000000,,,,0.0046570799313486,
SLRPNAKTEVR,ub,K,8,false,"Arabidopsis ubiquitination COFRADIC",40,26744219,"MaxQuant Score",79.4920000,1.0000000,,,,0.003000000026077,-0.4120000
SLRPNAKTEVR,ub,K,8,false,"upl3 mutant / wildtype",168,35926874,"MaxQuant score",47.0620000,1.0000000,-0.1568201,,,0.0088276201859117,0.2618400
VDAEEGR,nt,V,20,false,"Arg/N-end rule seed, prt6 vs. Wt",99,29168982,"MASCOT Score",29.8700000,,-0.4822316,0.1887730,NO,0.21389999985695,0.0511962
EQAVWALGNVAGDSPR,ph,S,194,false,"Tyrosine phosphorylation in Arabidopsis",59,18463617,"MASCOT Score",69.0000000,,,,,,-1.7726591
EQAVWALGNVAGDSPR,ph,S,194,false,"srk2dei ABA signaling phopshoproteomics",83,23572148,"MASCOT Score",99.0000000,,,,,,-0.0005000
EQAVWALGNVAGDSPR,ph,S,194,false,"SnRK2 protein kinase substrates",85,23776212,XCorr,4.6764860,1.0000000,,,,9.8783004345848E-13,
EQAVWALGNVAGDSPR,ph,S,194,false,"atm and atr DNA damage response",88,25561503,"MASCOT Score",77.0000000,1.0000000,,,,,-0.7100000
EQAVWALGNVAGDSPR,ph,S,194,false,"TOR Kinase and ABA Receptor",100,29290610,XCorr,5.4463062,1.0000000,,,,9.7659995645927E-9,
EQAVWALGNVAGDSPR,ph,S,194,false,"Lateral root-induction - NAA vs control",106,23328941,"MASCOT Score",64.0000000,,,,,,
EQAVWALGNVAGDSPR,ph,S,194,false,"Phospho cell culture sucrose/TOR",109,30833711,,,1.0000000,,,,,
EQAVWALGNVAGDSPR,ph,S,194,false,"Tissue atlas Arabidopsis - ProteomicsDB",114,32188942,"MaxQuant score",256.4900000,1.0000000,,,,0,
CRDLVLGQGALIPLLSQLNEHAK,so,C,197,true,"S-sulfenylation site detection using YAP1C",110,32714340,,,,,,,,
NATWTLSNFCR,so,C,234,false,"S-sulfenylation site detection using YAP1C",110,32714340,,,,,,,,
DQIQAVCEAGLICPLVNLLQNAEFDIK,sno,C,377,true,"hot5-4 / wildtype, FAT-switch S-nitrosoproteome",169,37277371,,,,0.4308703,0.1727688,NO,,
YMVEQGVVKPLCDLLVCPDPR,sno,C,428,true,"Site-specific nitrosomeproteomic id - gsnor1-3",90b,25699590,XCorr,2.5357075,,,,,0.32929998636246,-5.2431614
IITVCLEGLENILK,so,C,437,false,"S-sulfenylation site detection using YAP1C",110,32714340,,,,,,,,
IENLQSHDNSEIYEK,ph,S,485,true,"atm and atr DNA damage response",88,25561503,"MASCOT Score",37.0000000,1.0000000,,,,,-0.9700000
