Peptide,PTM,ModifiedAA,ModifiedPosition,PeptideUniqueToGene,ExperimentDesc,ExpID,PubmedID,ScoreType,IdentScore,LocProb,Log2FChange,PQ-val,QuantSig,PEP,MassErrorPPM
IDENEGVSASSK,ph,S,60,true,"Tissue atlas Arabidopsis - ProteomicsDB",114,32188942,"MaxQuant score",227.9200000,0.9942380,,,,0,
VLLDCGAVQADALTVDR,sno,C,126,true,"Site-specific nitrosomeproteomic id - gsnor1-3",90a,25699590,XCorr,2.3900000,,,,,0.0306599996984,-2.1200000
VLLDCGAVQADALTVDR,so,C,126,true,"Arabidopsis S-sulfenylation chemoproteomics",108,31578252,"pFind PSM Score",0.0579881,,,,,,-1.8185544
ADFVVSDVVPVACR,sno,C,181,true,"hot5-4 / wildtype, FAT-switch S-nitrosoproteome",169,37277371,,,,,,,,
ADFVVSDVVPVACR,so,C,181,true,"S-sulfenylation site detection using YAP1C",110,32714340,,,,,,,,
DAYTPDIIAASDCMLGK,sno,C,333,true,"hot5-4 / wildtype, FAT-switch S-nitrosoproteome",169,37277371,,,,,,,,
HCASDK,sno,C,427,true,"hot5-4 / wildtype, FAT-switch S-nitrosoproteome",169,37277371,,,,,,,,
HCASDK,so,C,427,true,"S-sulfenylation site detection using YAP1C",110,32714340,,,,,,,,
SLAMLDAIHDSEK,ph,S,524,true,"Tissue atlas Arabidopsis - ProteomicsDB",114,32188942,"MaxQuant score",166.1900000,1.0000000,,,,7.3091997677879E-15,
EACHVAVQR,so,C,581,true,"Arabidopsis S-sulfenylation chemoproteomics",108,31578252,"pFind PSM Score",0.0082027,,1.0322600,,,,1.0621918
NLPGKHR,ac,K,592,true,"Quantitative Acetylproteomics",101,29440448,,,,,,,,
SVKAPARHPIYENF,nt,S,895,true,"Arabidopsis translation initiation landscape - NT",167b,35069635,,,,,,,,
SNSEDGTLYGAK,ph,S,967,true,"Tissue atlas Arabidopsis - ProteomicsDB",114,32188942,"MaxQuant score",223.2800000,0.9999850,,,,1.1285805597948E-39,
ITGGGSGGTVCVVGR,ph,T,978,true,"srk2dei ABA signaling phopshoproteomics",83,23572148,"MASCOT Score",24.0000000,,,,,,0.0010000
ITGGGSGGTVCVVGR,sno,C,987,true,"Site-specific nitrosomeproteomic id - gsnor1-3",90a,25699590,XCorr,2.2254024,,,,,0.065180003643036,-5.9895042
ITGGGSGGTVCVVGR,sno,C,987,true,"Site-specific nitrosomeproteomic id - gsnor1-3",90b,25699590,XCorr,3.1400000,,,,,0.080269999802113,-6.9500000
ITGGGSGGTVCVVGR,so,C,987,true,"S-sulfenylation site detection using YAP1C",110,32714340,,,,,,,,
