Peptide,PTM,ModifiedAA,ModifiedPosition,PeptideUniqueToGene,ExperimentDesc,ExpID,PubmedID,ScoreType,IdentScore,LocProb,Log2FChange,PQ-val,QuantSig,PEP,MassErrorPPM
AMSQVMELEDESDFEKLLSSDNR,nt,A,52,true,"Arabidopsis translation initiation landscape - NT",167b,35069635,,,,,,,,
SQVMELEDESDFEKLLSSDNR,nt,S,54,true,"Stromal N-terminome",96,26371235,"MASCOT Score",66.4100000,,,,,,
SQVMELEDESDFEKLLSSDNR,nt,S,54,true,"HUNTER N-terminome: legumain, GluC and trypsin",119,31951383,"MaxQuant score",124.0800000,,,,,,
SQVMELEDESDFEKLLSSDNR,nta,S,54,true,"HUNTER N-terminome: legumain, GluC and trypsin",119,31951383,"MaxQuant score",121.2100000,,,,,,
SQVMELEDESDFEKLLSSDNR,nta,S,54,true,"Arabidopsis translation initiation landscape - NTA",167a,35069635,,,,,,,,
SQVMELEDESDFEK,nta,S,54,true,"Characterization plant N-terminal acetylation",6,22223895,"MASCOT Score",75.2900000,,,,,,
DDILPCR,sno,C,228,true,"hot5-4 / wildtype, FAT-switch S-nitrosoproteome",169,37277371,,,,,,,,
HCVLAAK,ox,C,235,true,"SPEAR - 10 mM H2O2 / mock",138a,34619326,,,,-0.9167946,0.0047145,YES,,
HCVLAAK,ox,C,235,true,"SPEAR - 50 mM H2O2 / mock",138b,34619326,,,,-1.9374311,0.0083663,YES,,
HCVLAAK,so,C,235,true,"Arabidopsis S-sulfenylation chemoproteomics",108,31578252,"pFind PSM Score",0.0226123,,1.0364500,,,,0.4409900
