Peptide,PTM,ModifiedAA,ModifiedPosition,PeptideUniqueToGene,ExperimentDesc,ExpID,PubmedID,ScoreType,IdentScore,LocProb,Log2FChange,PQ-val,QuantSig,PEP,MassErrorPPM
PAPTTEIEPIEAQSLK,nt,P,2,true,"Characterization plant N-terminal acetylation",6,22223895,"MASCOT Score",37.3300000,,,,,,
PAPTTEIEPIEAQSL,nt,P,2,true,"Arg/N-end rule seed, prt6 vs. Wt",99,29168982,"MASCOT Score",48.8400000,,0.1967460,0.6849522,NO,0.026310000568628,-2.1446341
PAPTTEIEPIEAQ,nt,P,2,true,"N-terminal ChaFRADIC",92,26010716,"MASCOT Score",76.9000000,,,,,3.3210000083272E-8,
PAPTTEIEPIEAQ,nt,P,2,true,"Arg/N-end rule seed, prt6 vs. Wt",99,29168982,"MASCOT Score",32.9800000,,0.1254308,0.4633001,NO,0.082139998674393,-1.1247583
PAPTTEIEPIEAQSLKK,ph,S,15,true,"Tissue atlas Arabidopsis - ProteomicsDB",114,32188942,"MaxQuant score",60.1330000,0.9999500,,,,0.00015395099762827,
GLNYTGSSGK,ph,S,125,true,"Tissue atlas Arabidopsis - ProteomicsDB",114,32188942,"MaxQuant score",108.5600000,0.8456300,,,,0.00022812900715508,
STTIIPANVSSYQR,ph,S,138,true,"Tissue atlas Arabidopsis - ProteomicsDB",114,32188942,"MaxQuant score",93.7160000,0.7841110,,,,0.00018386100418866,
NLSTAALMER,ph,S,145,false,"atm and atr DNA damage response",88,25561503,"MASCOT Score",46.0000000,1.0000000,,,,,-0.1300000
NLSTAALMER,ph,S,145,false,"Phospho cell culture sucrose/TOR",109,30833711,,,0.9977980,,,,,
NLSTAALMER,ph,S,145,false,"Tissue atlas Arabidopsis - ProteomicsDB",114,32188942,"MaxQuant score",159.5000000,0.9998480,,,,6.5993401676678E-7,
