Peptide,PTM,ModifiedAA,ModifiedPosition,PeptideUniqueToGene,ExperimentDesc,ExpID,PubmedID,ScoreType,IdentScore,LocProb,Log2FChange,PQ-val,QuantSig,PEP,MassErrorPPM
ANNNSNSPTGPH,nt,A,2,true,"Arg/N-end rule seed, prt6 vs. Wt",99,29168982,"MASCOT Score",24.8800000,,,,,0.16079999506474,-2.1031329
ANNNSNSPTGPHFLFVTFPAQGHINPSLELAKR,nta,A,2,true,"HUNTER N-terminome: legumain, GluC and trypsin",119,31951383,"MaxQuant score",50.7040000,,,,,,
ANNNSNSPTGPHFLFVTFPAQGHINPSLE,nta,A,2,true,"HUNTER N-terminome: legumain, GluC and trypsin",119,31951383,"MaxQuant score",81.3410000,,,,,,
ANNNSNSPTGPH,nta,A,2,true,"Arg/N-end rule seed, prt6 vs. Wt",99,29168982,"MASCOT Score",24.8800000,,,,,0.16079999506474,-2.1031329
KQLVELCK,acy,C,300,true,"Arabidopsis S-acylation atlas - Silique",163e,35681017,,,,,,,,
QLVELCK,sno,C,300,true,"hot5-4 / wildtype, FAT-switch S-nitrosoproteome",169,37277371,,,,1.3467395,0.0004077,YES,,
NKEDEQEKEEDCISSFR,sno,C,332,true,"Site-specific nitrosomeproteomic id - gsnor1-3",90b,25699590,XCorr,4.0563288,,,,,0.0048910002224147,-7.1890839
TGVRVMEK,mox,M,410,true,"cat2 Methionine oxidation - 3h stress",62b,25693801,"MASCOT Score",37.0000000,,-0.0693324,,NO,,
