Peptide,PTM,ModifiedAA,ModifiedPosition,PeptideUniqueToGene,ExperimentDesc,ExpID,PubmedID,ScoreType,IdentScore,LocProb,Log2FChange,PQ-val,QuantSig,PEP,MassErrorPPM
AILSPVSDPAASIAQKR,nt,A,69,true,"N-terminal ChaFRADIC",92,26010716,"MASCOT Score",33.5300000,,,,,5.1200000598328E-5,
AILSPVSDPAASIAQKR,nt,A,69,true,"Stromal N-terminome",96,26371235,"MASCOT Score",48.3700000,,,,,,
AILSPVSDPAASIAQKR,nt,A,69,true,"HUNTER N-terminome: legumain, GluC and trypsin",119,31951383,"MaxQuant score",72.1100000,,,,,,
AILSPVSDPAASIAQKR,nta,A,69,true,"N-terminal ChaFRADIC",92,26010716,"MASCOT Score",33.5300000,,,,,5.1200000598328E-5,
AILSPVSDPAASIAQKR,nta,A,69,true,"HUNTER N-terminome: legumain, GluC and trypsin",119,31951383,"MaxQuant score",,,,,,,
ILSPVSDPAASIAQKR,nt,I,70,true,"N-terminal ChaFRADIC",92,26010716,"MASCOT Score",43.5800000,,,,,3.7800000427524E-5,
ILSPVSDPAASIAQKR,nt,I,70,true,"Stromal N-terminome",96,26371235,"MASCOT Score",98.9000000,,,,,,
ILSPVSDPAASIAQKR,nta,I,70,true,"N-terminal ChaFRADIC",92,26010716,"MASCOT Score",43.5800000,,,,,3.7800000427524E-5,
ILSPVSDPAASIAQKR,nta,I,70,true,"Stromal N-terminome",96,26371235,"MASCOT Score",98.9000000,,,,,,
ILSPVSDPAASIAQKR,nta,I,70,true,"HUNTER N-terminome: legumain, GluC and trypsin",119,31951383,"MaxQuant score",,,,,,,
ILSPVSDPAASIAQK,nta,I,70,true,"Characterization plant N-terminal acetylation",6,22223895,"MASCOT Score",66.7000000,,,,,,
AILSPVSDPAASIAQK,ph,S,72,true,"Tissue atlas Arabidopsis - ProteomicsDB",114,32188942,"MaxQuant score",149.6000000,0.9999900,,,,3.6972000461155E-10,
VFTFGKGRSEGNKGMK,ub,K,98,true,"Arabidopsis ubiquitination by TUBEs",2,23667124,,,,,,,,
VFTFGKGRSEGNKGMK,ub,K,98,true,"MudPIT plant ubiquitination",103,17272265,XCorr,2.2300000,,,,,,
SINQITGLK,ph,S,308,true,"Tissue atlas Arabidopsis - ProteomicsDB",114,32188942,"MaxQuant score",92.6110000,1.0000000,,,,0.0019815100822598,
TETSPDDVGGMHAAEGILTAR,ph,T,514,true,"Tissue atlas Arabidopsis - ProteomicsDB",114,32188942,"MaxQuant score",111.5700000,0.9620410,,,,4.0751798636995E-12,
GGMTSHAAVVAR,ph,T,536,true,"Arabidopsis root NAA phosphoproteome",18a,27643528,"MaxQuant Score",44.5430000,0.9640000,,,,0.0010000000474975,0.3170000
GGMTSHAAVVAR,ph,T,536,true,"Phosphorylation nuclei-enriched fractions",28,19245862,,,,,,,,
GGMTSHAAVVAR,ph,T,536,true,"Ethylene-regulated phosphorylation ein2 mutant",30,19253305,"MASCOT Score",60.8696000,,,,,,9.4846570
GGMTSHAAVVAR,ph,T,536,true,"Immuno-dot blot phosphorylation",31,19341826,"MASCOT Score",43.3100000,,,,,,
GGMTSHAAVVAR,ph,T,536,true,"Phosphoproteome ethylene-regulated time response",46,24043427,"MASCOT Score",82.2300000,,,,,,9.9740000
GGMTSHAAVVAR,ph,T,536,true,"Tyrosine phosphorylation in Arabidopsis",59,18463617,"MASCOT Score",84.0000000,,,,,,-1.1331017
GGMTSHAAVVAR,ph,T,536,true,"Chloroplast kinase substrates",60,19376835,"MASCOT Score",39.1400000,,,,,,1.7204000
GGMTSHAAVVAR,ph,T,536,true,"BSK8 and BSL2 regulating sucrose-ph synthase",66,24924143,"MaxQuant Score",128.2200000,,,,,,-0.1183500
GGMTSHAAVVAR,ph,T,536,true,"srk2dei ABA signaling phopshoproteomics",83,23572148,"MASCOT Score",94.0000000,,,,,,-0.0016000
GGMTSHAAVVAR,ph,T,536,true,"LAXIC - ABA stress",84a,23660473,XCorr,3.5400000,0.9790000,,,,0.0089377695694566,
GGMTSHAAVVAR,ph,T,536,true,"LAXIC - mannitol vs control",84b,23660473,XCorr,3.1400000,0.9750000,,,,4.2400000666021E-7,
GGMTSHAAVVAR,ph,T,536,true,"SnRK2 protein kinase substrates",85,23776212,XCorr,3.8813114,0.9830000,,,,9.6947900601663E-5,
GGMTSHAAVVAR,ph,T,536,true,"atm and atr DNA damage response",88,25561503,"MASCOT Score",70.0000000,0.9580000,,,,,0.3400000
GGMTSHAAVVAR,ph,T,536,true,"Protein sumoylation and phosphorylation cross-talk",97,28419593,,,,,,,,
GGMTSHAAVVAR,ph,T,536,true,"TOR Kinase and ABA Receptor",100,29290610,XCorr,3.5795963,0.9950000,,,,3.3759999951144E-6,
GGMTSHAAVVAR,ph,T,536,true,"Lateral root-induction - NAA vs control",106,23328941,"MASCOT Score",34.0000000,,,,,,
GGMTSHAAVVAR,ph,T,536,true,"Phospho cell culture sucrose/TOR",109,30833711,,,0.9971190,,,,,
GGMTSHAAVVAR,ph,T,536,true,"Col-0 callus - FC Col-0 vs. Col-0 Xray",111a,31410901,,43.6700000,,-2.4392553,0.0000000,NO,,-0.0620847
GGMTSHAAVVAR,ph,T,536,true,"Col-0 X-ray callus - FC Col-0 vs. Col-0 Xray",111b,31410901,,43.6700000,,-2.4392553,0.0000000,NO,,-0.0620847
GGMTSHAAVVAR,ph,T,536,true,"atm callus - FC atm vs. atm Xray",111c,31410901,,43.6700000,,0.9410454,0.0000000,NO,,-0.0620847
GGMTSHAAVVAR,ph,T,536,true,"atm-3 X-ray callus - FC atm vs. atm Xray",111d,31410901,,43.6700000,,0.9410454,0.0000000,NO,,-0.0620847
GGMTSHAAVVAR,ph,T,536,true,"Tissue atlas Arabidopsis - ProteomicsDB",114,32188942,"MaxQuant score",236.0800000,0.9979480,,,,0,
GGMTSHAAVVAR,ph,T,536,true,"Touch-induced phosphorylation: 40s touch vs untouc",136,30291188,"MASCOT score",72.0700000,,0.2146695,0.4129447,NO,,12.1363065
GGMTSHAAVVAR,ph,S,537,true,"Tyrosine phosphorylation in Arabidopsis",59,18463617,"MASCOT Score",44.0000000,,,,,,-1.5377815
GGMTSHAAVVAR,ph,S,537,true,"Chloroplast kinase substrates",60,19376835,"MASCOT Score",33.1900000,,,,,,-0.7047000
GGMTSHAAVVAR,ph,S,537,true,"srk2dei ABA signaling phopshoproteomics",83,23572148,"MASCOT Score",72.0000000,,,,,,-0.0003000
GGMTSHAAVVAR,ph,S,537,true,"atm and atr DNA damage response",88,25561503,"MASCOT Score",49.0000000,1.0000000,,,,,-0.1700000
GGMTSHAAVVAR,ph,S,537,true,"TOR Kinase and ABA Receptor",100,29290610,XCorr,3.8490176,0.9206000,,,,1.5269999948941E-6,
GGMTSHAAVVAR,ph,S,537,true,"Lateral root-induction - NAA vs control",106,23328941,"MASCOT Score",58.0000000,,,,,,
