Peptide,PTM,ModifiedAA,ModifiedPosition,PeptideUniqueToGene,ExperimentDesc,ExpID,PubmedID,ScoreType,IdentScore,LocProb,Log2FChange,PQ-val,QuantSig,PEP,MassErrorPPM
FPGIGEFQCYDK,sno,C,211,false,"Site-specific nitrosomeproteomic id - gsnor1-3",90a,25699590,XCorr,2.4010696,,,,,0.00021080000442453,-5.8937845
FPGIGEFQCYDK,sno,C,211,false,"Site-specific nitrosomeproteomic id - gsnor1-3",90b,25699590,XCorr,2.6200000,,,,,4.1989998862846E-5,-7.3400000
LSDTVFQENNFELFKK,cr,K,438,true,"Open search Plant PTM Viewer 2.0 - Crotonylation",164c,TBA,,,,,,,,
MHADQDYCGDAAK,sno,C,451,true,"Site-specific nitrosomeproteomic id - gsnor1-3",90a,25699590,XCorr,4.2489343,,,,,2.7170000294063E-7,-5.9144961
MHADQDYCGDAAK,sno,C,451,true,"Site-specific nitrosomeproteomic id - gsnor1-3",90b,25699590,XCorr,4.4200000,,,,,0.00078419997589663,-7.4100000
TSNSQLTLEDIADAAQPSGAFK,ph,S,469,true,"Tissue atlas Arabidopsis - ProteomicsDB",114,32188942,"MaxQuant score",465.3100000,0.9998880,,,,0,
TSNSQLTLEDIADAAQPSGAFK,ph,T,472,true,"srk2dei ABA signaling phopshoproteomics",83,23572148,"MASCOT Score",42.0000000,,,,,,0.0001000
WDSETDLKVDG,ph,S,490,true,"Tissue atlas Arabidopsis - ProteomicsDB",114,32188942,"MaxQuant score",186.5000000,0.9998510,,,,3.10697986978E-14,
