Peptide,PTM,ModifiedAA,ModifiedPosition,PeptideUniqueToGene,ExperimentDesc,ExpID,PubmedID,ScoreType,IdentScore,LocProb,Log2FChange,PQ-val,QuantSig,PEP,MassErrorPPM
MDAELEPVALTPQKQDN,nta,M,1,true,"HUNTER N-terminome: legumain, GluC and trypsin",119,31951383,"MaxQuant score",75.0450000,,,,,,
MDAELEPVALTPQK,nta,M,1,true,"Characterization plant N-terminal acetylation",6,22223895,"MASCOT Score",63.3800000,,,,,,
MDAELEPVALTPQKQDNAWK,ph,T,11,true,"Tissue atlas Arabidopsis - ProteomicsDB",114,32188942,"MaxQuant score",233.4900000,1.0000000,,,,0,
SPGSSDVVVQNESLLSGR,ph,S,122,true,"srk2dei ABA signaling phopshoproteomics",83,23572148,"MASCOT Score",64.0000000,,,,,,-0.0016000
SPGSSDVVVQNESLLSGR,ph,S,122,true,"TOR Kinase and ABA Receptor",100,29290610,XCorr,4.7574329,0.9026000,,,,1.4690000682549E-7,
SPGSSDVVVQNESLLSGR,ph,S,122,true,"Lateral root-induction - NAA vs control",106,23328941,"MASCOT Score",79.0000000,,,,,,
SPGSSDVVVQNESLLSGR,ph,S,122,true,"Col-0 callus - FC Col-0 vs. Col-0 Xray",111a,31410901,,76.8600000,,0.3078124,0.0000000,NO,,1.1377864
SPGSSDVVVQNESLLSGR,ph,S,122,true,"Col-0 X-ray callus - FC Col-0 vs. Col-0 Xray",111b,31410901,,76.8600000,,0.3078124,0.0000000,NO,,1.1377864
SPGSSDVVVQNESLLSGR,ph,S,122,true,"atm callus - FC atm vs. atm Xray",111c,31410901,,76.8600000,,0.7554057,0.0000000,NO,,1.1377864
SPGSSDVVVQNESLLSGR,ph,S,122,true,"atm-3 X-ray callus - FC atm vs. atm Xray",111d,31410901,,76.8600000,,0.7554057,0.0000000,NO,,1.1377864
SPGSSDVVVQNESLLSGR,ph,S,122,true,"Tissue atlas Arabidopsis - ProteomicsDB",114,32188942,"MaxQuant score",326.8200000,0.9998940,,,,0,
SPGSSDVVVQNESLLSGR,ph,S,125,true,"srk2dei ABA signaling phopshoproteomics",83,23572148,"MASCOT Score",59.0000000,,,,,,-0.0028000
SPGSSDVVVQNESLLSGR,ph,S,125,true,"atm and atr DNA damage response",88,25561503,"MASCOT Score",36.0000000,0.9930000,,,,,0.3700000
SPGSSDVVVQNESLLSGR,ph,S,125,true,"Lateral root-induction - NAA vs control",106,23328941,"MASCOT Score",34.0000000,,,,,,
SPGSSDVVVQNESLLSGR,ph,S,125,true,"Tissue atlas Arabidopsis - ProteomicsDB",114,32188942,"MaxQuant score",323.4700000,0.9919090,,,,0,
SPGSSDVVVQNESLLSGR,ph,S,126,true,"Tissue atlas Arabidopsis - ProteomicsDB",114,32188942,"MaxQuant score",304.2000000,0.9945240,,,,0,
NAFENGSASNNVDLIGR,ph,S,156,true,"Tissue atlas Arabidopsis - ProteomicsDB",114,32188942,"MaxQuant score",219.2300000,0.9988680,,,,0,
NAFENGSASNNVDLIGR,ph,S,158,true,"Tissue atlas Arabidopsis - ProteomicsDB",114,32188942,"MaxQuant score",79.9200000,0.9052600,,,,0.00028248099260963,
DMDNLIPVAISSVK,ph,S,178,false,"atm and atr DNA damage response",88,25561503,"MASCOT Score",24.0000000,0.9960000,,,,,0.3600000
NIVHPSFRDR,ph,S,186,true,"Tissue atlas Arabidopsis - ProteomicsDB",114,32188942,"MaxQuant score",147.3000000,1.0000000,,,,0.0011160500580445,
NIVHPSFR,ph,S,186,true,"atm and atr DNA damage response",88,25561503,"MASCOT Score",35.0000000,1.0000000,,,,,-1.1300000
