Peptide,PTM,ModifiedAA,ModifiedPosition,PeptideUniqueToGene,ExperimentDesc,ExpID,PubmedID,ScoreType,IdentScore,LocProb,Log2FChange,PQ-val,QuantSig,PEP,MassErrorPPM
SGESPGVLIK,ph,S,11,true,"Tissue atlas Arabidopsis - ProteomicsDB",114,32188942,"MaxQuant score",193.3000000,1.0000000,,,,1.217269964297E-13,
RSSSGCLIVK,ph,S,21,true,"atm and atr DNA damage response",88,25561503,"MASCOT Score",25.0000000,0.9930000,,,,,-0.4300000
SSSGCLIVK,ph,S,21,true,"atm and atr DNA damage response",88,25561503,"MASCOT Score",43.0000000,0.9960000,,,,,-1.3800000
SSSGCLIVK,ph,S,21,true,"Tissue atlas Arabidopsis - ProteomicsDB",114,32188942,"MaxQuant score",72.8910000,0.8181950,,,,0.003536680014804,
SSSGCLIVK,ph,S,22,true,"Tissue atlas Arabidopsis - ProteomicsDB",114,32188942,"MaxQuant score",63.7340000,0.8689900,,,,0.018005400896072,
ICSFSESRPNWESNKR,ph,S,38,true,"Tissue atlas Arabidopsis - ProteomicsDB",114,32188942,"MaxQuant score",84.2490000,0.9991340,,,,8.3078797615599E-5,
MITSDSESSDRFTIPR,ph,S,57,true,"TOR Kinase and ABA Receptor",100,29290610,XCorr,2.3233409,0.9648000,,,,0.0072200000286102,
MITSDSESSDR,ph,S,57,true,"atm and atr DNA damage response",88,25561503,"MASCOT Score",50.0000000,0.9080000,,,,,-0.9900000
MITSDSESSDR,ph,S,57,true,"Tissue atlas Arabidopsis - ProteomicsDB",114,32188942,"MaxQuant score",99.8440000,0.9957270,,,,2.5668099624454E-5,
HRLDDDDDNDDDEESEDELMAMR,ph,S,124,true,"atm and atr DNA damage response",88,25561503,"MASCOT Score",100.0000000,1.0000000,,,,,-0.0300000
SFDGSGVDIGKK,ph,S,136,true,"atm and atr DNA damage response",88,25561503,"MASCOT Score",25.0000000,0.9960000,,,,,-3.1200000
SFDGSGVDIGKK,ph,S,136,true,"Tissue atlas Arabidopsis - ProteomicsDB",114,32188942,"MaxQuant score",136.0100000,0.9999980,,,,1.6500500350958E-5,
SFDGSGVDIGK,ph,S,136,true,"atm and atr DNA damage response",88,25561503,"MASCOT Score",46.0000000,1.0000000,,,,,0.2700000
ELHSASDSDGKATFAR,ph,S,468,true,"atm and atr DNA damage response",88,25561503,"MASCOT Score",36.0000000,1.0000000,,,,,-0.3700000
ELHSASDSDGKATFAR,ph,S,468,true,"Tissue atlas Arabidopsis - ProteomicsDB",114,32188942,"MaxQuant score",76.1230000,0.9999980,,,,0.00062958197668195,
ELHSASDSDGKATFAR,ph,S,470,true,"atm and atr DNA damage response",88,25561503,"MASCOT Score",36.0000000,1.0000000,,,,,-0.3700000
ELHSASDSDGKATFAR,ph,S,470,true,"Tissue atlas Arabidopsis - ProteomicsDB",114,32188942,"MaxQuant score",76.1230000,0.9995550,,,,0.0004793890111614,
ELHSASDSDGKATFAR,ph,S,472,true,"atm and atr DNA damage response",88,25561503,"MASCOT Score",36.0000000,1.0000000,,,,,-0.3700000
ELHSASDSDGKATFAR,ph,S,472,true,"Tissue atlas Arabidopsis - ProteomicsDB",114,32188942,"MaxQuant score",76.1230000,0.9897650,,,,0.00062958197668195,
NFLAIKNEVGNDDRYVHK,sumo,K,486,true,"SUMO Ligase SIZ1 heat stress",4,29588388,,,,,,,,
VDGGKSSKHGR,ac,K,546,true,"Histone deacetylases- hda14 vs WT (low light)",98c,29061669,"MaxQuant Score",120.5700000,1.0000000,0.2670000,0.9885531,NO,6.6000000515487E-5,
VDGGKSSKHGR,ac,K,546,true,"Histone deacetylases - hda14 vs WT (thylakoids)",98d,29061669,"MaxQuant Score",90.6000000,1.0000000,0.2180000,0.9571941,NO,0.00026900001103058,
VDGGKSSKHGR,ac,K,546,true,"Histone deacetylases substrates - hda14 vs WT",98e,29061669,"MaxQuant Score",50.4000000,1.0000000,0.2730000,0.6698846,NO,0.017000000923872,
VDGGKSSKHGR,ac,K,546,true,"Quantitative Acetylproteomics",101,29440448,,,,,,,,
VDGGKSSKHGR,ac,K,549,true,"Histone deacetylases- hda14 vs WT (low light)",98c,29061669,"MaxQuant Score",120.5700000,1.0000000,0.2670000,0.9885531,NO,6.6000000515487E-5,
VDGGKSSKHGR,ac,K,549,true,"Histone deacetylases - hda14 vs WT (thylakoids)",98d,29061669,"MaxQuant Score",90.6000000,1.0000000,0.2180000,0.9571941,NO,0.00026900001103058,
VDGGKSSKHGR,ac,K,549,true,"Histone deacetylases substrates - hda14 vs WT",98e,29061669,"MaxQuant Score",50.4000000,1.0000000,0.2730000,0.6698846,NO,0.017000000923872,
VDGGKSSKHGR,ac,K,549,true,"Quantitative Acetylproteomics",101,29440448,,,,,,,,
HTESAVDTDCDPCNEGTNSAIK,ph,S,991,true,"Tissue atlas Arabidopsis - ProteomicsDB",114,32188942,"MaxQuant score",65.2480000,0.7512880,,,,1.4956500308472E-5,
HTESAVDTDCDPCNEGTNSAIK,ph,T,995,true,"Tissue atlas Arabidopsis - ProteomicsDB",114,32188942,"MaxQuant score",100.3900000,0.9974740,,,,3.9975099619394E-11,
TNEVSVLETTSPSR,ph,T,1019,true,"Tissue atlas Arabidopsis - ProteomicsDB",114,32188942,"MaxQuant score",201.3000000,0.7713710,,,,3.6755599807221E-33,
TNEVSVLETTSPSR,ph,S,1020,true,"LAXIC - ABA stress",84a,23660473,XCorr,3.3900000,0.9930000,,,,0.010153000243008,
TNEVSVLETTSPSR,ph,S,1020,true,"SnRK2 protein kinase substrates",85,23776212,XCorr,2.3102317,0.9940000,,,,0.0068227499723434,
TNEVSVLETTSPSR,ph,S,1020,true,"atm and atr DNA damage response",88,25561503,"MASCOT Score",68.0000000,0.9520000,,,,,0.9800000
TNEVSVLETTSPSR,ph,S,1020,true,"Tissue atlas Arabidopsis - ProteomicsDB",114,32188942,"MaxQuant score",263.0400000,0.9581400,,,,0,
TNEVSVLETTSPSR,ph,S,1022,true,"Tissue atlas Arabidopsis - ProteomicsDB",114,32188942,"MaxQuant score",165.5800000,0.9945560,,,,7.0121100766152E-12,
DKPVSDYLVEHQPYEDVSSASR,ph,S,1028,true,"Tissue atlas Arabidopsis - ProteomicsDB",114,32188942,"MaxQuant score",68.2690000,0.9966800,,,,8.3128497863072E-6,
FDGEDEEDSLIESPPQR,ph,S,1093,true,"atm and atr DNA damage response",88,25561503,"MASCOT Score",29.0000000,1.0000000,,,,,-0.7500000
FDGEDEEDSLIESPPQR,ph,S,1093,true,"Tissue atlas Arabidopsis - ProteomicsDB",114,32188942,"MaxQuant score",102.1600000,1.0000000,,,,2.1287000890879E-6,
FDGEDEEDSLIESPPQR,ph,S,1097,true,"SnRK2 protein kinase substrates",85,23776212,XCorr,2.0309961,1.0000000,,,,0.02542670071125,
FDGEDEEDSLIESPPQR,ph,S,1097,true,"atm and atr DNA damage response",88,25561503,"MASCOT Score",29.0000000,1.0000000,,,,,-0.7500000
FDGEDEEDSLIESPPQR,ph,S,1097,true,"TOR Kinase and ABA Receptor",100,29290610,XCorr,3.3382549,1.0000000,,,,0.00066139997215942,
FDGEDEEDSLIESPPQR,ph,S,1097,true,"Tissue atlas Arabidopsis - ProteomicsDB",114,32188942,"MaxQuant score",341.0100000,1.0000000,,,,0,
NSDMAFLDHIIRSPVDTGATENR,ph,S,1114,true,"TOR Kinase and ABA Receptor",100,29290610,XCorr,4.2574897,0.9774000,,,,0.00025909999385476,
SPVDTGATENR,ph,S,1114,true,"atm and atr DNA damage response",88,25561503,"MASCOT Score",43.0000000,1.0000000,,,,,0.2500000
SPVDTGATENR,ph,S,1114,true,"Tissue atlas Arabidopsis - ProteomicsDB",114,32188942,"MaxQuant score",230.7400000,1.0000000,,,,0,
DVYGSGDDDSPETQ,ph,S,1129,true,"atm and atr DNA damage response",88,25561503,"MASCOT Score",38.0000000,0.9940000,,,,,-0.1200000
