Peptide,PTM,ModifiedAA,ModifiedPosition,PeptideUniqueToGene,ExperimentDesc,ExpID,PubmedID,ScoreType,IdentScore,LocProb,Log2FChange,PQ-val,QuantSig,PEP,MassErrorPPM
ASRIAKDVTELIGNTPLVY,nta,A,2,true,"Arabidopsis translation initiation landscape - NTA",167a,35069635,,,,,,,,
ASRIAKDVTE,nta,A,2,true,"HUNTER N-terminome: legumain, GluC and trypsin",119,31951383,"MaxQuant score",41.4270000,,,,,,
NVAEGCVGR,nt,N,23,true,"Arg/N-end rule seed, prt6 vs. Wt",99,29168982,"MASCOT Score",38.8200000,,-0.4214394,0.2801311,NO,0.021640000864863,-1.4870670
DVTELIGNTPLVYLNNVAEGCVGR,sno,C,28,true,"hot5-4 / wildtype, FAT-switch S-nitrosoproteome",169,37277371,,,,0.1045170,0.5585964,NO,,
LEMMEPCSSVK,acy,C,42,false,"Arabidopsis S-acylation atlas - Hypocotyl",163b,35681017,,,,,,,,
LEMMEPCSSVK,acy,C,42,false,"Arabidopsis S-acylation atlas - Silique",163e,35681017,,,,,,,,
LEMMEPCSSVKDR,ox,C,42,false,"OxiTRAQ Arabidopsis - 5 mM H2O2 versus control",47,24376095,,,,0.0111614,0.8495108,NO,,
LEMMEPCSSVK,ox,C,42,false,"OxiTRAQ Arabidopsis - 5 mM H2O2 versus control",47,24376095,,,,-0.0062294,0.7061635,NO,,
LEMMEPCSSVK,sno,C,42,false,"Site-specific nitrosomeproteomic id - gsnor1-3",90a,25699590,XCorr,2.5638280,,,,,0.00075539998942986,-6.7470588
LEMMEPCSSVK,sno,C,42,false,"Site-specific nitrosomeproteomic id - gsnor1-3",90b,25699590,XCorr,2.2200000,,,,,0.037849999964237,-6.9600000
LEMMEPCSSVK,sno,C,42,false,"hot5-4 / wildtype, FAT-switch S-nitrosoproteome",169,37277371,,,,-0.2534022,0.1315823,NO,,
LEMMEPCSSVKDR,so,C,42,false,"S-sulfenylation site detection using YAP1C",110,32714340,,,,,,,,
DRIGFSMISDAEK,mox,M,53,true,"cat2 Methionine oxidation - 1h stress",62a,25693801,"MASCOT Score",96.0000000,,-0.0109989,,NO,,
DRIGFSMISDAEK,mox,M,53,true,"cat2 Methionine oxidation - 3h stress",62b,25693801,"MASCOT Score",29.0000000,,0.0356705,,NO,,
IGFSMISDAEKK,ub,K,59,true,"upl3 mutant / wildtype",168,35926874,"MaxQuant score",48.1150000,1.0000000,0.1518588,,,0.0052086398936808,-1.9453000
GAIAKAEEILAK,cr,K,131,true,"Open search Plant PTM Viewer 2.0 - Crotonylation",164c,TBA,,,,,,,,
GAIAKAEEILAK,ub,K,131,true,"upl3 mutant / wildtype",168,35926874,"MaxQuant score",50.2220000,1.0000000,,,,0.017181299626827,1.7598000
ILAKTPNGYMLQQFENPANPKIHYE,nt,I,135,false,"Arabidopsis translation initiation landscape - NT",167b,35069635,,,,,,,,
AEEILAKTPNGYMLQQFENPANPK,ub,K,138,false,"upl3 mutant / wildtype",168,35926874,"MaxQuant score",101.4800000,1.0000000,0.7476022,,,6.5389300961741E-13,-0.2803200
IHYETTGPEIWKGTGGK,ac,K,167,true,"Histone deacetylases substrates - TSA vs control",98b,29061669,"MaxQuant Score",81.5000000,1.0000000,0.4250000,0.7550922,NO,1.399999973728E-6,
IHYETTGPEIWKGTGGK,ac,K,167,true,"Histone deacetylases substrates - hda14 vs WT",98e,29061669,"MaxQuant Score",56.3000000,1.0000000,0.0980000,0.9120108,NO,0.00023999999393709,
IHYETTGPEIWKGTGGK,ub,K,167,true,"upl3 mutant / wildtype",168,35926874,"MaxQuant score",112.6700000,1.0000000,0.0285692,,,3.3322500314625E-9,-0.2907100
GTGGKIDGFVSGIGTGGTITGAGK,ub,K,172,true,"upl3 mutant / wildtype",168,35926874,"MaxQuant score",120.6300000,1.0000000,0.2326608,0.7923600,NO,4.9192600600554E-18,2.0351000
IDGFVSGIGTGGTITGAGK,ph,T,182,true,"Tissue atlas Arabidopsis - ProteomicsDB",114,32188942,"MaxQuant score",124.8400000,0.8528210,,,,5.6465801408527E-14,
IDGFVSGIGTGGTITGAGK,ph,T,185,true,"Tissue atlas Arabidopsis - ProteomicsDB",114,32188942,"MaxQuant score",187.3900000,0.9138290,,,,3.0670300651884E-36,
IDGFVSGIGTGGTITGAGKYLK,ub,K,191,true,"upl3 mutant / wildtype",168,35926874,"MaxQuant score",121.4700000,1.0000000,-0.6529013,0.2705600,NO,1.402569961274E-16,1.8330000
QNANVKLYGVEPVE,nt,Q,196,true,"HUNTER N-terminome: legumain, GluC and trypsin",119,31951383,"MaxQuant score",57.5500000,,,,,,
EQNANVKLYGVEPVESAILSGGKPGPHK,ub,K,201,true,"upl3 mutant / wildtype",168,35926874,"MaxQuant score",106.1100000,1.0000000,1.1420866,0.3641400,NO,1.2370700465945E-16,0.4217200
LYGVEPVESAILSGGKPGPHK,ph,S,210,true,"Tissue atlas Arabidopsis - ProteomicsDB",114,32188942,"MaxQuant score",41.7630000,0.9802110,,,,0.0033635799773037,
LYGVEPVESAILSGGKPGPHK,ub,K,217,true,"upl3 mutant / wildtype",168,35926874,"MaxQuant score",109.5000000,1.0000000,-0.2986727,,,2.0766199523847E-11,-0.1331200
VDLIDEVVQVSSDESIDMAR,nt,V,237,true,"Metacaspase9 substrates - Col-0 / mc9",51a,23964026,"MASCOT Score",68.0000000,,1.2418355,,NO,,-2.2735952
LIDEVVQVSSDESIDMAR,nt,L,239,true,"Arg/N-end rule seed, prt6 vs. Wt",99,29168982,"MASCOT Score",22.5400000,,,,,0.22050000727177,-1.4440092
YLSTVLFDATRK,ph,S,304,true,"TOR Kinase and ABA Receptor",100,29290610,XCorr,2.6873956,0.9621000,,,,0.02237999998033,
KEAEAMTFEA,ub,K,313,true,"Arabidopsis ubiquitination COFRADIC",40,26744219,"MaxQuant Score",72.3210000,1.0000000,,,,0.0010000000474975,-0.0940000
KEAEAMTFEA,ub,K,313,true,"upl3 mutant / wildtype",168,35926874,"MaxQuant score",76.2280000,1.0000000,0.2141248,0.6640600,NO,0.0061546498909593,1.5020000
EAEAMTFEA,mox,M,318,true,"cat2 Methionine oxidation - 1h stress",62a,25693801,"MASCOT Score",45.0000000,,0.5245794,,NO,,
