Peptide,PTM,ModifiedAA,ModifiedPosition,PeptideUniqueToGene,ExperimentDesc,ExpID,PubmedID,ScoreType,IdentScore,LocProb,Log2FChange,PQ-val,QuantSig,PEP,MassErrorPPM
MDSSGTDSAKELH,nt,M,56,true,"Arg/N-end rule seed, prt6 vs. Wt",99,29168982,"MASCOT Score",95.0100000,,,,,0.00017250000382774,-1.8048054
MDSSGTDSAKE,nt,M,56,true,"Arg/N-end rule seed, prt6 vs. Wt",99,29168982,"MASCOT Score",74.0000000,,,,,1.4879999525874E-6,-1.2450613
MDSSGTDSAKELH,nta,M,56,true,"Arg/N-end rule seed, prt6 vs. Wt",99,29168982,"MASCOT Score",95.0100000,,-1.0064678,0.1778765,NO,0.00017250000382774,-1.8048054
MDSSGTDSAKE,nta,M,56,true,"Arg/N-end rule seed, prt6 vs. Wt",99,29168982,"MASCOT Score",74.0000000,,-0.1064311,0.3756407,NO,1.4879999525874E-6,-1.2450613
DSSGTDSAKELH,nt,D,57,true,"Arg/N-end rule seed, prt6 vs. Wt",99,29168982,"MASCOT Score",23.3500000,,-0.2503011,0.1737588,NO,0.052609998732805,-0.4225550
DSSGTDSAKE,nt,D,57,true,"Arg/N-end rule seed, prt6 vs. Wt",99,29168982,"MASCOT Score",27.7400000,,-0.0855585,0.2327341,NO,0.0068859998136759,-0.3448293
SISSGFCPR,acy,C,369,true,"Arabidopsis S-acylation atlas - Meristem",163a,35681017,,,,,,,,
SISSGFCPR,acy,C,369,true,"Arabidopsis S-acylation atlas - Seedling",163d,35681017,,,,,,,,
SISSGFCPR,acy,C,369,true,"Arabidopsis S-acylation atlas - Silique",163e,35681017,,,,,,,,
SISSGFCPR,sno,C,369,true,"Site-specific nitrosomeproteomic id - gsnor1-3",90a,25699590,XCorr,2.2928562,,,,,0.0032909999135882,-6.5497614
LPESTNIVDVIQVVNCPK,sno,C,425,true,"Site-specific nitrosomeproteomic id - gsnor1-3",90b,25699590,XCorr,3.6900000,,,,,0.0081820003688335,-2.8300000
LPESTNIVDVIQVVNCPK,sno,C,425,true,"hot5-4 / wildtype, FAT-switch S-nitrosoproteome",169,37277371,,,,0.7836197,0.0009179,YES,,
FHQMSPISHISK,ph,S,742,true,"Tissue atlas Arabidopsis - ProteomicsDB",114,32188942,"MaxQuant score",90.4530000,0.9981690,,,,0.00010086400288856,
