Peptide,PTM,ModifiedAA,ModifiedPosition,PeptideUniqueToGene,ExperimentDesc,ExpID,PubmedID,ScoreType,IdentScore,LocProb,Log2FChange,PQ-val,QuantSig,PEP,MassErrorPPM
GDLGIAMNQSQDNDQDEEDDPREGAVEVVNRR,ng,N,44,true,"ER-associatied N-glycan degradation chilling stres",133,27558752,,,,,,,,
GDLGIAMNQSQDNDQDEEDDPREGAVEVVNR,ph,S,46,true,"TOR Kinase and ABA Receptor",100,29290610,XCorr,3.0268216,1.0000000,,,,0.0018639999907464,
GDLGIAMNQSQDNDQDEEDDPREGAVEVVNR,ph,S,46,true,"Col-0 callus - FC Col-0 vs. Col-0 Xray",111a,31410901,,34.8900000,,4.8654680,0.0000000,NO,,1.5736354
GDLGIAMNQSQDNDQDEEDDPREGAVEVVNR,ph,S,46,true,"Col-0 X-ray callus - FC Col-0 vs. Col-0 Xray",111b,31410901,,34.8900000,,4.8654680,0.0000000,NO,,1.5736354
GDLGIAMNQSQDNDQDEEDDPREGAVEVVNR,ph,S,46,true,"atm callus - FC atm vs. atm Xray",111c,31410901,,34.8900000,,0.9199182,0.0000000,NO,,1.5736354
GDLGIAMNQSQDNDQDEEDDPREGAVEVVNR,ph,S,46,true,"atm-3 X-ray callus - FC atm vs. atm Xray",111d,31410901,,34.8900000,,0.9199182,0.0000000,NO,,1.5736354
GDLGIAMNQSQDNDQDEEDDPR,ph,S,46,true,"Tissue atlas Arabidopsis - ProteomicsDB",114,32188942,"MaxQuant score",204.5000000,1.0000000,,,,0,
APIFVTRDSPNALR,ph,S,90,true,"Tissue atlas Arabidopsis - ProteomicsDB",114,32188942,"MaxQuant score",119.0800000,0.8139120,,,,9.9896396932309E-6,
LPMEEEEDGGGSR,ph,S,225,true,"Lateral root-induction - NAA vs control",106,23328941,"MASCOT Score",31.0000000,,,,,,
LPMEEEEDGGGSR,ph,S,225,true,"Tissue atlas Arabidopsis - ProteomicsDB",114,32188942,"MaxQuant score",179.5500000,1.0000000,,,,1.0127499799778E-21,
QIHGGGDSPPR,ph,S,234,true,"TOR Kinase and ABA Receptor",100,29290610,XCorr,2.5983362,1.0000000,,,,1.9020000763703E-5,
QIHGGGDSPPR,ph,S,234,true,"Lateral root-induction - NAA vs control",106,23328941,"MASCOT Score",21.0000000,,,,,,
QIHGGGDSPPR,ph,S,234,true,"Col-0 callus - FC Col-0 vs. Col-0 Xray",111a,31410901,,38.1900000,,1.6692436,0.0000000,NO,,-0.1097205
QIHGGGDSPPR,ph,S,234,true,"Col-0 X-ray callus - FC Col-0 vs. Col-0 Xray",111b,31410901,,38.1900000,,1.6692436,0.0000000,NO,,-0.1097205
QIHGGGDSPPR,ph,S,234,true,"atm callus - FC atm vs. atm Xray",111c,31410901,,38.1900000,,-4.3864526,0.0000000,NO,,-0.1097205
QIHGGGDSPPR,ph,S,234,true,"atm-3 X-ray callus - FC atm vs. atm Xray",111d,31410901,,38.1900000,,-4.3864526,0.0000000,NO,,-0.1097205
QIHGGGDSPPR,ph,S,234,true,"Tissue atlas Arabidopsis - ProteomicsDB",114,32188942,"MaxQuant score",180.3100000,1.0000000,,,,5.065039845333E-14,
