Peptide,PTM,ModifiedAA,ModifiedPosition,PeptideUniqueToGene,ExperimentDesc,ExpID,PubmedID,ScoreType,IdentScore,LocProb,Log2FChange,PQ-val,QuantSig,PEP,MassErrorPPM
MQMQSLQER,ph,S,67,true,"Tissue atlas Arabidopsis - ProteomicsDB",114,32188942,"MaxQuant score",107.3400000,1.0000000,,,,0.00013837500591762,
LAAAEVSEEEQNNLLK,ph,S,88,true,"Tissue atlas Arabidopsis - ProteomicsDB",114,32188942,"MaxQuant score",191.9100000,1.0000000,,,,1.6550900192533E-35,
NVSGALQSDGRPVATR,ph,S,284,true,"STN8 phosphoproteome",38,21768351,"MASCOT Score",61.2300000,,,,,,1.9136900
NVSGALQSDGRPVATR,ph,S,284,true,"srk2dei ABA signaling phopshoproteomics",83,23572148,"MASCOT Score",53.0000000,,,,,,-0.0001000
NVSGALQSDGRPVATR,ph,S,284,true,"atm and atr DNA damage response",88,25561503,"MASCOT Score",55.0000000,0.9870000,,,,,0.7600000
NVSGALQSDGRPVATR,ph,S,284,true,"TOR Kinase and ABA Receptor",100,29290610,XCorr,2.5334849,0.9957000,,,,0.02191000059247,
NVSGALQSDGRPVATR,ph,S,284,true,"Tissue atlas Arabidopsis - ProteomicsDB",114,32188942,"MaxQuant score",161.1900000,1.0000000,,,,1.2807100215409E-13,
NVSGALQSDGR,ph,S,284,true,"atm and atr DNA damage response",88,25561503,"MASCOT Score",59.0000000,1.0000000,,,,,1.6000000
MLAYSTVGTPDYIAPEVLLKK,ph,S,317,false,"Phosphoproteome ethylene-regulated time response",46,24043427,"MASCOT Score",98.5700000,,,,,,-5.5468000
MLAYSTVGTPDYIAPEVLLK,ph,S,317,false,"Arabidopsis root NAA phosphoproteome",18a,27643528,"MaxQuant Score",103.8400000,0.7820000,,,,2.2539999380844E-12,1.0620000
MLAYSTVGTPDYIAPEVLLK,ph,S,317,false,"Phosphorylation Early Elicitor Signaling",23,17317660,,,,,,,,
MLAYSTVGTPDYIAPEVLLK,ph,S,317,false,"Large-scale phosphorylation discovery",44,23111157,XCorr,4.0560000,,,,,,
MLAYSTVGTPDYIAPEVLLK,ph,S,317,false,"TOR Kinase and ABA Receptor",100,29290610,XCorr,4.8219776,0.8933000,,,,1.391000026274E-8,
MLAYSTVGTPDYIAPEVLLK,ph,S,317,false,"Phospho cell culture sucrose/TOR",109,30833711,,,0.7919210,,,,,
MLAYSTVGTPDYIAPEVLLK,ph,S,317,false,"Tissue atlas Arabidopsis - ProteomicsDB",114,32188942,"MaxQuant score",298.9300000,0.9905700,,,,0,
LAYSTVGTPDYIAPEVLLK,ph,S,317,false,"Tissue atlas Arabidopsis - ProteomicsDB",114,32188942,"MaxQuant score",93.7680000,0.8231690,,,,4.6758100324951E-6,
MLSSKDINFVGYTYK,ph,S,470,false,"Tissue atlas Arabidopsis - ProteomicsDB",114,32188942,"MaxQuant score",260.0900000,0.9996330,,,,0,
MLSSKDINFVGYTYK,ph,S,471,false,"Tissue atlas Arabidopsis - ProteomicsDB",114,32188942,"MaxQuant score",149.0900000,0.9590820,,,,1.8847799765354E-8,
DINFVGYTYK,ph,T,480,false,"atm and atr DNA damage response",88,25561503,"MASCOT Score",57.0000000,0.9550000,,,,,-1.4800000
DINFVGYTYK,ph,T,480,false,"TOR Kinase and ABA Receptor",100,29290610,XCorr,3.2443783,0.9922000,,,,0.0069129997864366,
DINFVGYTYK,ph,T,480,false,"Tissue atlas Arabidopsis - ProteomicsDB",114,32188942,"MaxQuant score",146.5000000,1.0000000,,,,1.8319500441066E-6,
DINFVGYTYK,ph,T,480,false,"Touch-induced phosphorylation: 40s touch vs untouc",136,30291188,"MASCOT score",57.7300000,,-0.4516729,0.0295639,YES,,7.7538541
