Peptide,PTM,ModifiedAA,ModifiedPosition,PeptideUniqueToGene,ExperimentDesc,ExpID,PubmedID,ScoreType,IdentScore,LocProb,Log2FChange,PQ-val,QuantSig,PEP,MassErrorPPM
NVSSQGALGDR,ph,S,355,true,"Tissue atlas Arabidopsis - ProteomicsDB",114,32188942,"MaxQuant score",72.4960000,0.8893410,,,,0.0023001600056887,
HRSSDDIPSSAK,ph,S,367,true,"atm and atr DNA damage response",88,25561503,"MASCOT Score",25.0000000,0.9960000,,,,,-0.6500000
HRSSDDIPSSAK,ph,S,367,true,"TOR Kinase and ABA Receptor",100,29290610,XCorr,2.8160627,0.9093000,,,,0.067759998142719,
GVISSTRPGSSAEPSENHSSR,ph,S,399,true,"Tissue atlas Arabidopsis - ProteomicsDB",114,32188942,"MaxQuant score",174.4900000,0.9433310,,,,5.5454599789853E-37,
GVISSTRPGSSAEPSENHSSR,ph,S,404,true,"Tissue atlas Arabidopsis - ProteomicsDB",114,32188942,"MaxQuant score",73.8650000,0.7810000,,,,5.4023898883315E-6,
NFELLTIGSGKK,ph,T,449,true,"Tissue atlas Arabidopsis - ProteomicsDB",114,32188942,"MaxQuant score",106.5400000,0.9375130,,,,0.00019433599663898,
NFELLTIGSGKK,ph,S,452,true,"atm and atr DNA damage response",88,25561503,"MASCOT Score",43.0000000,1.0000000,,,,,0.0800000
NFELLTIGSGK,ph,S,452,true,"atm and atr DNA damage response",88,25561503,"MASCOT Score",66.0000000,1.0000000,,,,,-0.7200000
NFELLTIGSGK,ph,S,452,true,"TOR Kinase and ABA Receptor",100,29290610,XCorr,4.0783453,1.0000000,,,,7.5039999501314E-5,
NFELLTIGSGK,ph,S,452,true,"Tissue atlas Arabidopsis - ProteomicsDB",114,32188942,"MaxQuant score",165.6400000,0.9986080,,,,2.5053799312946E-11,
