Peptide,PTM,ModifiedAA,ModifiedPosition,PeptideUniqueToGene,ExperimentDesc,ExpID,PubmedID,ScoreType,IdentScore,LocProb,Log2FChange,PQ-val,QuantSig,PEP,MassErrorPPM
VNIPKTK,ac,K,6,false,"Quantitative Acetylproteomics",101,29440448,,,,,,,,
NTYCK,ox,C,12,false,"OxiTRAQ Arabidopsis - 5 mM H2O2 versus control",47,24376095,,,,0.4506913,0.0402611,NO,,
TKNTYCK,so,C,12,false,"S-sulfenylation site detection using YAP1C",110,32714340,,,,,,,,
NKECKK,so,C,17,false,"S-sulfenylation site detection using YAP1C",110,32714340,,,,,,,,
GKDSLAAQGKR,ac,K,40,false,"Quantitative Acetylproteomics",101,29440448,,,,,,,,
DSLAAQGKR,ac,K,40,false,"Quantitative Acetylproteomics",101,29440448,,,,,,,,
LQCQSCK,so,C,77,false,"Arabidopsis S-sulfenylation chemoproteomics",108,31578252,"pFind PSM Score",0.3418880,,,,,,1.2064730
HFEIGGDKK,ac,K,97,false,"Quantitative Acetylproteomics",101,29440448,,,,,,,,
