Peptide,PTM,ModifiedAA,ModifiedPosition,PeptideUniqueToGene,ExperimentDesc,ExpID,PubmedID,ScoreType,IdentScore,LocProb,Log2FChange,PQ-val,QuantSig,PEP,MassErrorPPM
ALVSIHGEAAGK,ph,S,196,true,"atm and atr DNA damage response",88,25561503,"MASCOT Score",28.0000000,1.0000000,,,,,-0.2700000
ALVSIHGEAAGK,ph,S,196,true,"Tissue atlas Arabidopsis - ProteomicsDB",114,32188942,"MaxQuant score",119.2500000,1.0000000,,,,3.2463900424773E-5,
EGNHDSVIVR,ph,S,371,true,"Tissue atlas Arabidopsis - ProteomicsDB",114,32188942,"MaxQuant score",143.3100000,1.0000000,,,,6.1321202338149E-7,
ANGQSFISEAGR,ph,S,383,true,"atm and atr DNA damage response",88,25561503,"MASCOT Score",62.0000000,1.0000000,,,,,0.6800000
ANGQSFISEAGR,ph,S,383,true,"TOR Kinase and ABA Receptor",100,29290610,XCorr,3.1221840,0.9913000,,,,0.00015140000323299,
ANGQSFISEAGR,ph,S,383,true,"Tissue atlas Arabidopsis - ProteomicsDB",114,32188942,"MaxQuant score",203.9700000,1.0000000,,,,1.0020400030873E-30,
SEEIEDGDVIGII,nt,S,397,true,"N-terminal ChaFRADIC",92,26010716,"MASCOT Score",52.7700000,,,,,2.301999979526E-10,
GSGGPKTPK,ph,T,470,true,"atm and atr DNA damage response",88,25561503,"MASCOT Score",33.0000000,1.0000000,,,,,-3.8100000
ASSTPKPDDK,ph,T,476,true,"atm and atr DNA damage response",88,25561503,"MASCOT Score",33.0000000,0.9330000,,,,,-2.0200000
