Peptide,PTM,ModifiedAA,ModifiedPosition,PeptideUniqueToGene,ExperimentDesc,ExpID,PubmedID,ScoreType,IdentScore,LocProb,Log2FChange,PQ-val,QuantSig,PEP,MassErrorPPM
ISPGPSPSR,ph,S,233,true,"atm and atr DNA damage response",88,25561503,"MASCOT Score",37.0000000,1.0000000,,,,,-0.0200000
ISPGPSPSR,ph,S,233,true,"Tissue atlas Arabidopsis - ProteomicsDB",114,32188942,"MaxQuant score",66.5600000,0.9998480,,,,0.014306399971247,
ISPGPSPSR,ph,S,237,true,"atm and atr DNA damage response",88,25561503,"MASCOT Score",37.0000000,0.9920000,,,,,-0.0200000
SSQSPKSPEASSLPEAIK,ph,S,244,true,"Tissue atlas Arabidopsis - ProteomicsDB",114,32188942,"MaxQuant score",103.9500000,0.9559600,,,,6.5288901396343E-7,
SSQSPKSPEASSLPEAIK,ph,S,247,true,"Large-scale phosphorylation discovery",44,23111157,XCorr,4.3140000,,,,,,
SSQSPKSPEASSLPEAIK,ph,S,247,true,"atm and atr DNA damage response",88,25561503,"MASCOT Score",59.0000000,1.0000000,,,,,-1.5500000
SPEASSLPEAIK,ph,S,247,true,"TOR Kinase and ABA Receptor",100,29290610,XCorr,3.2583318,1.0000000,,,,0.0010430000256747,
SPEASSLPEAIK,ph,S,247,true,"Tissue atlas Arabidopsis - ProteomicsDB",114,32188942,"MaxQuant score",173.3600000,1.0000000,,,,1.4943199919793E-27,
