Peptide,PTM,ModifiedAA,ModifiedPosition,PeptideUniqueToGene,ExperimentDesc,ExpID,PubmedID,ScoreType,IdentScore,LocProb,Log2FChange,PQ-val,QuantSig,PEP,MassErrorPPM
AEMADKAKVEEMDWEGIDGVR,nt,A,2,true,"Stromal N-terminome",96,26371235,"MASCOT Score",50.2400000,,,,,,
AEMADKAKVE,nt,A,2,true,"N-term acetylation drought responses",5,26184543,,,,,,,,
AEMADKAKVEEMDWEGIDGVR,nta,A,2,true,"Arg/N-end rule pathway Roots",80,25728785,"MASCOT Score",41.4900000,,,,,2.1290000873364E-8,
AEMADKAKVEEMDWEGIDGVR,nta,A,2,true,"Stromal N-terminome",96,26371235,"MASCOT Score",50.2400000,,,,,,
AEMADKAKVEEMDWEGIDGVR,nta,A,2,true,"HUNTER N-terminome: legumain, GluC and trypsin",119,31951383,"MaxQuant score",63.0560000,,,,,,
AEMADKAKVE,nta,A,2,true,"N-term acetylation drought responses",5,26184543,,,,,,,,
AEMADKAK,ac,K,7,true,"Quantitative Acetylproteomics",101,29440448,,,,,,,,
AKVEEMDWEGIDGVR,ub,K,9,true,"upl3 mutant / wildtype",168,35926874,"MaxQuant score",62.0550000,1.0000000,-0.5458241,,,0.00031711300835013,-0.2794700
VEASKCVIPLAASISPIR,ub,K,37,true,"upl3 mutant / wildtype",168,35926874,"MaxQuant score",68.2430000,1.0000000,1.2302030,,,6.6752596467268E-5,-0.0237690
VEASKCVIPLAASISPIR,so,C,38,true,"Arabidopsis S-sulfenylation chemoproteomics",108,31578252,"pFind PSM Score",0.0880444,,0.9394800,,,,1.2177703
CVIPLAASISPIRR,so,C,38,true,"S-sulfenylation site detection using YAP1C",110,32714340,,,,,,,,
VFVFKGNK,ac,K,195,true,"Quantitative Acetylproteomics",101,29440448,,,,,,,,
RAPTSGFSK,ph,T,220,true,"atm and atr DNA damage response",88,25561503,"MASCOT Score",26.0000000,0.9970000,,,,,-2.2800000
RAPTSGFSK,ph,S,224,true,"Tissue atlas Arabidopsis - ProteomicsDB",114,32188942,"MaxQuant score",63.4010000,0.9998240,,,,0.014007199555635,
IVALVGGPCTEGPGTIISK,ox,C,304,true,"SPEAR - 10 mM H2O2 / mock",138a,34619326,,,,0.2341913,0.0276370,YES,,
IVALVGGPCTEGPGTIISK,so,C,304,true,"S-sulfenylation site detection using YAP1C",110,32714340,,,,,,,,
DLDKDAAPYYK,ub,K,328,false,"upl3 mutant / wildtype",168,35926874,"MaxQuant score",81.0170000,1.0000000,0.2363395,,,0.0015791900223121,-0.1928800
IQGVIGPCSSLEK,sno,C,432,true,"hot5-4 / wildtype, FAT-switch S-nitrosoproteome",169,37277371,,,,0.4923978,0.0014455,NO,,
IQGVIGPCSSLEK,so,C,432,true,"S-sulfenylation site detection using YAP1C",110,32714340,,,,,,,,
YQNSEGKSLAR,ac,K,501,true,"Quantitative Acetylproteomics",101,29440448,,,,,,,,
LVVCDQHGSQAR,sno,C,719,false,"Site-specific nitrosomeproteomic id - gsnor1-3",90a,25699590,XCorr,3.9673533,,,,,8.7349999375874E-6,-6.7144502
LVVCDQHGSQAR,sno,C,719,false,"Site-specific nitrosomeproteomic id - gsnor1-3",90b,25699590,XCorr,3.5300000,,,,,0.028489999473095,-6.9200000
LVVCDQHGSQAR,sno,C,719,false,"hot5-4 / wildtype, FAT-switch S-nitrosoproteome",169,37277371,,,,,,,,
LVVCDQHGSQAR,so,C,719,false,"Arabidopsis S-sulfenylation chemoproteomics",108,31578252,"pFind PSM Score",0.0001570,,1.3018100,,,,-1.5293762
LVVCDQHGSQAR,so,C,719,false,"S-sulfenylation site detection using YAP1C",110,32714340,,,,,,,,
LVVCDQHGSQAR,ph,S,724,false,"Phospho cell culture sucrose/TOR",109,30833711,,,1.0000000,,,,,
LVVCDQHGSQAR,ph,S,724,false,"Tissue atlas Arabidopsis - ProteomicsDB",114,32188942,"MaxQuant score",131.3500000,1.0000000,,,,3.6464698496275E-5,
