Peptide,PTM,ModifiedAA,ModifiedPosition,PeptideUniqueToGene,ExperimentDesc,ExpID,PubmedID,ScoreType,IdentScore,LocProb,Log2FChange,PQ-val,QuantSig,PEP,MassErrorPPM
MDLSPVKEALAAKSF,nta,M,1,true,"Arabidopsis translation initiation landscape - NTA",167a,35069635,,,,,,,,
MDLSPVKEA,nta,M,1,true,"N-terminal ChaFRADIC",92,26010716,"MASCOT Score",36.5600000,,,,,0.0061590000987053,
MDLSPVKE,nta,M,1,true,"N-terminal ChaFRADIC",92,26010716,"MASCOT Score",60.1000000,,,,,0.029279999434948,
MDLSPVKEALAAK,ph,S,4,true,"Phospho cell culture sucrose/TOR",109,30833711,,,1.0000000,,,,,
MDLSPVKEALAAK,ph,S,4,true,"Tissue atlas Arabidopsis - ProteomicsDB",114,32188942,"MaxQuant score",147.8300000,1.0000000,,,,1.7944900321254E-7,
MDLSPVKEALAAK,ub,K,7,true,"upl3 mutant / wildtype",168,35926874,"MaxQuant score",75.1020000,1.0000000,-0.0409718,,,2.0540399418678E-5,-1.8477000
EALAAKSFDK,ub,K,13,true,"upl3 mutant / wildtype",168,35926874,"MaxQuant score",108.4700000,1.0000000,0.0827026,0.8939000,NO,0.00065732502844185,0.6261000
IPTAIKER,ub,K,70,true,"Arabidopsis ubiquitination COFRADIC",40,26744219,"MaxQuant Score",41.8760000,1.0000000,,,,0.021999999880791,1.1100000
EQKVDSSKLQR,ub,K,184,true,"Arabidopsis ubiquitination COFRADIC",40,26744219,"MaxQuant Score",50.3540000,1.0000000,,,,0.0060000000521541,0.2710000
