Peptide,PTM,ModifiedAA,ModifiedPosition,PeptideUniqueToGene,ExperimentDesc,ExpID,PubmedID,ScoreType,IdentScore,LocProb,Log2FChange,PQ-val,QuantSig,PEP,MassErrorPPM
RESGNIFHQNFSNK,ph,S,244,true,"Tissue atlas Arabidopsis - ProteomicsDB",114,32188942,"MaxQuant score",109.6500000,1.0000000,,,,1.5480000001844E-5,
LRLELSPADSDMNMVSHSIQSSNEEGASPK,ph,S,283,true,"Tissue atlas Arabidopsis - ProteomicsDB",114,32188942,"MaxQuant score",166.1200000,0.9999800,,,,0,
GILSGGDPNTTLTK,ph,S,289,true,"atm and atr DNA damage response",88,25561503,"MASCOT Score",75.0000000,1.0000000,,,,,-0.4100000
GILSGGDPNTTLTK,ph,S,289,true,"TOR Kinase and ABA Receptor",100,29290610,XCorr,5.5967135,1.0000000,,,,2.2889998945175E-6,
GILSGGDPNTTLTK,ph,S,289,true,"Lateral root-induction - NAA vs control",106,23328941,"MASCOT Score",39.0000000,,,,,,
GILSGGDPNTTLTK,ph,S,289,true,"Col-0 callus - FC Col-0 vs. Col-0 Xray",111a,31410901,,47.7500000,,-0.3982367,0.0000000,NO,,1.3127933
GILSGGDPNTTLTK,ph,S,289,true,"Col-0 X-ray callus - FC Col-0 vs. Col-0 Xray",111b,31410901,,47.7500000,,-0.3982367,0.0000000,NO,,1.3127933
GILSGGDPNTTLTK,ph,S,289,true,"atm callus - FC atm vs. atm Xray",111c,31410901,,47.7500000,,-0.9802337,0.0000000,NO,,1.3127933
GILSGGDPNTTLTK,ph,S,289,true,"atm-3 X-ray callus - FC atm vs. atm Xray",111d,31410901,,47.7500000,,-0.9802337,0.0000000,NO,,1.3127933
GILSGGDPNTTLTK,ph,S,289,true,"Tissue atlas Arabidopsis - ProteomicsDB",114,32188942,"MaxQuant score",223.7000000,1.0000000,,,,0,
