Peptide,PTM,ModifiedAA,ModifiedPosition,PeptideUniqueToGene,ExperimentDesc,ExpID,PubmedID,ScoreType,IdentScore,LocProb,Log2FChange,PQ-val,QuantSig,PEP,MassErrorPPM
MEDDGKSSPKLPIPGKRNILITSALPY,nta,M,1,true,"Arabidopsis translation initiation landscape - NTA",167a,35069635,,,,,,,,
MEDDGKSSPK,nta,M,1,true,"N-term acetylation drought responses",5,26184543,,,,,,,,
MEDDGKSSPKLPIPGK,ph,S,8,true,"Tissue atlas Arabidopsis - ProteomicsDB",114,32188942,"MaxQuant score",133.5400000,0.8459630,,,,6.7388299385129E-8,
MEDDGKSSPK,ph,S,8,true,"atm and atr DNA damage response",88,25561503,"MASCOT Score",27.0000000,0.9990000,,,,,-1.8200000
ALEENCTPK,ox,C,80,true,"OxiTRAQ Arabidopsis - 5 mM H2O2 versus control",47,24376095,,,,0.4722897,0.0169158,YES,,
TSTPEQTEVCQAIFNK,sno,C,119,true,"Site-specific nitrosomeproteomic id - gsnor1-3",90a,25699590,XCorr,2.2468174,,,,,0.00065499998163432,-3.5369496
TSTPEQTEVCQAIFNK,sno,C,119,true,"Site-specific nitrosomeproteomic id - gsnor1-3",90b,25699590,XCorr,3.6100000,,,,,0.076059997081757,-7.5600000
TSTPEQTEVCQAIFNK,sno,C,119,true,"hot5-4 / wildtype, FAT-switch S-nitrosoproteome",169,37277371,,,,0.0558694,0.4080155,NO,,
TSTPEQTEVCQAIFNK,so,C,119,true,"S-sulfenylation site detection using YAP1C",110,32714340,,,,,,,,
LVEGSCPFEGCNYDSAR,ox,C,158,true,"SPEAR - 50 mM H2O2 / mock",138b,34619326,,,,7.8884781,0.0123241,YES,,
VCQNTPR,sno,C,193,true,"hot5-4 / wildtype, FAT-switch S-nitrosoproteome",169,37277371,,,,,,,,
VCQNTPR,so,C,193,true,"S-sulfenylation site detection using YAP1C",110,32714340,,,,,,,,
SKGVGVFGNDVK,ph,S,352,true,"atm and atr DNA damage response",88,25561503,"MASCOT Score",36.0000000,1.0000000,,,,,-1.4800000
EDKPLCAVVIR,sno,C,497,true,"hot5-4 / wildtype, FAT-switch S-nitrosoproteome",169,37277371,,,,,,,,
EDKPLCAVVIR,so,C,497,true,"Arabidopsis S-sulfenylation chemoproteomics",108,31578252,"pFind PSM Score",0.0600302,,1.5151300,,,,0.5882638
EDKPLCAVVIR,so,C,497,true,"S-sulfenylation site detection using YAP1C",110,32714340,,,,,,,,
IGTPQPLFK,ph,T,563,true,"Tissue atlas Arabidopsis - ProteomicsDB",114,32188942,"MaxQuant score",108.9000000,1.0000000,,,,0.0015201499918476,
ELENDEVAR,nt,E,570,true,"Metacaspase9 substrates - Col-0 / mc9",51a,23964026,"MASCOT Score",55.0000000,,1.0143287,,NO,,0.3485675
DEAANLADQLNKTK,ph,T,606,true,"Tissue atlas Arabidopsis - ProteomicsDB",114,32188942,"MaxQuant score",108.7500000,1.0000000,,,,0.00042848300654441,
DVPFTTSAGVCK,so,C,786,true,"S-sulfenylation site detection using YAP1C",110,32714340,,,,,,,,
