Peptide,PTM,ModifiedAA,ModifiedPosition,PeptideUniqueToGene,ExperimentDesc,ExpID,PubmedID,ScoreType,IdentScore,LocProb,Log2FChange,PQ-val,QuantSig,PEP,MassErrorPPM
SCSATDLAVLLGPNATAAANYICGQLGDVNNK,ng,N,15,true,"ER-associatied N-glycan degradation chilling stres",133,27558752,,,,,,,,
ISSEDEMAGMDMTR,ph,T,460,true,"Arabidopsis root NAA phosphoproteome",18a,27643528,"MaxQuant Score",72.7720000,1.0000000,,,,9.2020002284698E-7,-0.4600000
ISSEDEMAGMDMTR,ph,T,460,true,"Plasmamembrane phosphorylation",20,15308754,,,,,,,,
ISSEDEMAGMDMTR,ph,T,460,true,"Phosphorylation Early Elicitor Signaling",23,17317660,,,,,,,,
ISSEDEMAGMDMTR,ph,T,460,true,"Phosphorylation nuclei-enriched fractions",28,19245862,,,,,,,,
ISSEDEMAGMDMTR,ph,T,460,true,"Large-scale phosphorylation discovery",44,23111157,XCorr,4.6230000,,,,,,
ISSEDEMAGMDMTR,ph,T,460,true,"Tyrosine phosphorylation in Arabidopsis",59,18463617,"MASCOT Score",57.0000000,,,,,,-1.2109537
ISSEDEMAGMDMTR,ph,T,460,true,"Phosphorylation in N starvation",63,22060019,"MASCOT Score",21.0000000,,,,,,-4.4087700
ISSEDEMAGMDMTR,ph,T,460,true,"BSK8 and BSL2 regulating sucrose-ph synthase",66,24924143,"MaxQuant Score",244.1000000,,,,,,-0.7393300
ISSEDEMAGMDMTR,ph,T,460,true,"SIRK1 phosphorylation",86a,23820729,"MaxQuant Score",193.1300000,1.0000000,,,,1.6500000299402E-7,5.1620000
ISSEDEMAGMDMTR,ph,T,460,true,"SIRK1 exp - sirk1 mutant vs WT",86b,23820729,,,,0.0961827,,NO,,
ISSEDEMAGMDMTR,ph,T,460,true,"SIRK1 exp - 35S:SIRK1 vs WT",86c,23820729,,,,-1.2168504,,NO,,
ISSEDEMAGMDMTR,ph,T,460,true,"atm and atr DNA damage response",88,25561503,"MASCOT Score",87.0000000,1.0000000,,,,,0.2900000
ISSEDEMAGMDMTR,ph,T,460,true,"TOR Kinase and ABA Receptor",100,29290610,XCorr,5.4423943,1.0000000,,,,4.5400000203699E-7,
ISSEDEMAGMDMTR,ph,T,460,true,"Lateral root-induction - NAA vs control",106,23328941,"MASCOT Score",30.0000000,,,,,,
ISSEDEMAGMDMTR,ph,T,460,true,"Phosphorylation tonoplast membrane fraction",107,18686298,"MASCOT Score",79.0000000,,,,,,
ISSEDEMAGMDMTR,ph,T,460,true,"Phospho cell culture sucrose/TOR",109,30833711,,,1.0000000,,,,,
ISSEDEMAGMDMTR,ph,T,460,true,"Tissue atlas Arabidopsis - ProteomicsDB",114,32188942,"MaxQuant score",318.3200000,1.0000000,,,,0,
HGGFAYMYFDDDESHKAIQLR,ph,S,475,true,"Arabidopsis root NAA phosphoproteome",18a,27643528,"MaxQuant Score",108.9600000,1.0000000,,,,1.1209999637794E-17,-0.1210000
HGGFAYMYFDDDESHKAIQLR,ph,S,475,true,"Tissue atlas Arabidopsis - ProteomicsDB",114,32188942,"MaxQuant score",318.7200000,1.0000000,,,,0,
HGGFAYMYFDDDESHK,ph,S,475,true,"Phosphorylation Early Elicitor Signaling",23,17317660,,,,,,,,
HGGFAYMYFDDDESHK,ph,S,475,true,"Phosphoproteome iron-deficient Arabidopsis roots",41,22438062,"MASCOT Score",46.9300000,,,,,,
HGGFAYMYFDDDESHK,ph,S,475,true,"Tyrosine phosphorylation in Arabidopsis",59,18463617,"MASCOT Score",41.0000000,,,,,,-0.0500568
HGGFAYMYFDDDESHK,ph,S,475,true,"atm and atr DNA damage response",88,25561503,"MASCOT Score",44.0000000,1.0000000,,,,,0.2800000
HGGFAYMYFDDDESHK,ph,S,475,true,"Brassinosteroid-Regulated Phosphorylation Dynamics",94,26187819,"MaxQuant Score",131.2500000,1.0000000,,,,1.093999977414E-11,-2.9590000
HGGFAYMYFDDDESHK,ph,S,475,true,"TOR Kinase and ABA Receptor",100,29290610,XCorr,6.3603144,1.0000000,,,,1.1340000050097E-8,
HGGFAYMYFDDDESHK,ph,S,475,true,"Phospho cell culture sucrose/TOR",109,30833711,,,0.9999950,,,,,
HGGFAYMYFDDDESHKAIQLR,ub,K,477,true,"upl3 mutant / wildtype",168,35926874,"MaxQuant score",209.6600000,1.0000000,0.1256511,0.5602800,NO,0,0.4185100
RVEPRSPSPSGANTTPTPV,ph,S,488,true,"Phosphorylation Early Elicitor Signaling",23,17317660,,,,,,,,
RVEPRSPSPSGANTTPTPV,ph,S,488,true,"atm and atr DNA damage response",88,25561503,"MASCOT Score",31.0000000,0.9990000,,,,,-0.0600000
RVEPRSPSPSGANTTPTPV,ph,S,488,true,"TOR Kinase and ABA Receptor",100,29290610,XCorr,4.3636265,0.9354000,,,,0.00057139998534694,
RVEPRSPSPSGANTTPTPV,ph,S,488,true,"Tissue atlas Arabidopsis - ProteomicsDB",114,32188942,"MaxQuant score",245.1000000,1.0000000,,,,0,
VEPRSPSPSGANTTPTPV,ph,S,488,true,"atm and atr DNA damage response",88,25561503,"MASCOT Score",34.0000000,0.9990000,,,,,-0.5000000
SPSPSGANTTPTPV,ph,S,488,true,"ABA-induced protein phosphorylation",35,20733066,,,,,,,,
SPSPSGANTTPTPV,ph,S,488,true,"Large-scale phosphorylation discovery",44,23111157,XCorr,3.7500000,,,,,,
SPSPSGANTTPTPV,ph,S,488,true,"Phosphoproteome ethylene-regulated time response",46,24043427,"MASCOT Score",35.4900000,,,,,,6.4153000
SPSPSGANTTPTPV,ph,S,488,true,"Chloroplast kinase substrates",60,19376835,"MASCOT Score",44.8700000,,,,,,-0.5420320
SPSPSGANTTPTPV,ph,S,488,true,"srk2dei ABA signaling phopshoproteomics",83,23572148,"MASCOT Score",43.0000000,,,,,,0.0002000
SPSPSGANTTPTPV,ph,S,488,true,"LAXIC - ABA stress",84a,23660473,XCorr,2.7700000,0.7810000,,,,0.11888399720192,
SPSPSGANTTPTPV,ph,S,488,true,"atm and atr DNA damage response",88,25561503,"MASCOT Score",59.0000000,1.0000000,,,,,0.9400000
SPSPSGANTTPTPV,ph,S,488,true,"Protein sumoylation and phosphorylation cross-talk",97,28419593,,,,,,,,
SPSPSGANTTPTPV,ph,S,488,true,"TOR Kinase and ABA Receptor",100,29290610,XCorr,3.4987235,0.8891000,,,,0.00043610000284389,
SPSPSGANTTPTPV,ph,S,488,true,"Lateral root-induction - NAA vs control",106,23328941,"MASCOT Score",44.0000000,,,,,,
RVEPRSPSPSGANTTPTPV,ph,S,490,true,"Tissue atlas Arabidopsis - ProteomicsDB",114,32188942,"MaxQuant score",245.1000000,0.9980510,,,,0,
VEPRSPSPSGANTTPTPV,ph,S,490,true,"atm and atr DNA damage response",88,25561503,"MASCOT Score",36.0000000,0.9200000,,,,,-0.6200000
SPSPSGANTTPTPV,ph,S,490,true,"Phytohormone-responsive phosphoproteins",34,20374526,"MASCOT Score",53.0000000,,,,,,
SPSPSGANTTPTPV,ph,S,490,true,"Large-scale phosphorylation discovery",44,23111157,XCorr,3.7790000,,,,,,
SPSPSGANTTPTPV,ph,S,490,true,"Phosphorylation in N starvation",63,22060019,"MASCOT Score",99.0000000,,,,,,-5.9811400
SPSPSGANTTPTPV,ph,S,490,true,"srk2dei ABA signaling phopshoproteomics",83,23572148,"MASCOT Score",51.0000000,,,,,,0.0006000
SPSPSGANTTPTPV,ph,S,490,true,"atm and atr DNA damage response",88,25561503,"MASCOT Score",59.0000000,0.9980000,,,,,0.9400000
SPSPSGANTTPTPV,ph,S,490,true,"Lateral root-induction - NAA vs control",106,23328941,"MASCOT Score",41.0000000,,,,,,
RVEPRSPSPSGANTTPTPV,ph,S,492,true,"Phosphorylation Early Elicitor Signaling",23,17317660,,,,,,,,
RVEPRSPSPSGANTTPTPV,ph,S,492,true,"atm and atr DNA damage response",88,25561503,"MASCOT Score",31.0000000,0.9920000,,,,,-0.0600000
VEPRSPSPSGANTTPTPV,ph,S,492,true,"atm and atr DNA damage response",88,25561503,"MASCOT Score",34.0000000,0.9910000,,,,,-0.5000000
RVEPRSPSPSGANTTPTPV,ph,T,496,true,"Phosphorylation Early Elicitor Signaling",23,17317660,,,,,,,,
SPSPSGANTTPTPV,ph,T,497,true,"atm and atr DNA damage response",88,25561503,"MASCOT Score",34.0000000,0.9870000,,,,,0.1100000
SPSPSGANTTPTPV,ph,T,497,true,"Tissue atlas Arabidopsis - ProteomicsDB",114,32188942,"MaxQuant score",115.2600000,0.9875810,,,,0.00032143699354492,
SPSPSGANTTPTPV,ph,T,499,true,"Large-scale phosphorylation discovery",44,23111157,XCorr,3.4870000,,,,,,
