Peptide,PTM,ModifiedAA,ModifiedPosition,PeptideUniqueToGene,ExperimentDesc,ExpID,PubmedID,ScoreType,IdentScore,LocProb,Log2FChange,PQ-val,QuantSig,PEP,MassErrorPPM
MDDFTGLLAR,nta,M,1,false,"Arg/N-end rule pathway Roots",80,25728785,"MASCOT Score",84.5200000,,,,,2.506000100766E-7,
MDDFTGLLAR,nta,M,1,false,"Arg/N-end rule seed, prt6 vs. Wt",99,29168982,"MASCOT Score",90.4500000,,,,,0.0028059999458492,-1.1039701
MDDFTGLLAR,nta,M,1,false,"Arabidopsis translation initiation landscape - NTA",167a,35069635,,,,,,,,
SAPMASQSNSSAADFNTFASSYSFASAAGK,fuc,T,36,true,"SPINDLY O-fucosylation",162,36739885,,,,,,,1.7999999523163,
SAPMASQSNSSAADFNTFASSYSFASAAGK,fuc,S,39,true,"SPINDLY O-fucosylation",162,36739885,,,,,,,-0.08500000089407,
SAPMASQSNSSAADFNTFASSYSFASAAGKK,fuc,S,40,true,"SPINDLY O-fucosylation",162,36739885,,,,,,,0.34000000357628,
SAPMASQSNSSAADFNTFASSYSFASAAGKKSDSLPVFDDLGR,fuc,S,45,true,"SPINDLY O-fucosylation",162,36739885,,,,,,,-0.30000001192093,
SAPMASQSNSSAADFNTFASSYSFASAAGKK,fuc,S,45,true,"SPINDLY O-fucosylation",162,36739885,,,,,,,2,
KSDSLPVFDDLGR,ph,S,53,true,"atm and atr DNA damage response",88,25561503,"MASCOT Score",32.0000000,1.0000000,,,,,-1.0300000
KSDSLPVFDDLGR,ph,S,53,true,"Tissue atlas Arabidopsis - ProteomicsDB",114,32188942,"MaxQuant score",211.1200000,0.9999850,,,,1.6642198912907E-39,
SDSLPVFDDLGR,ph,S,53,true,"atm and atr DNA damage response",88,25561503,"MASCOT Score",35.0000000,1.0000000,,,,,-1.2700000
DVFSGPPPKYGSSGDSR,ub,K,79,true,"Arabidopsis ubiquitination COFRADIC",40,26744219,"MaxQuant Score",43.7940000,1.0000000,,,,0.00016589999722783,0.1520000
YGSSGDSRSPSAPAFDYDVMFK,ph,S,88,true,"Tissue atlas Arabidopsis - ProteomicsDB",114,32188942,"MaxQuant score",173.5500000,0.9579150,,,,1.9618178500547E-44,
YGSSGDSRSPSAPAFDYDVMFK,ph,S,90,true,"TOR Kinase and ABA Receptor",100,29290610,XCorr,3.4752436,0.9691000,,,,5.0840000767494E-5,
IPSTSSQSAR,ph,S,137,false,"Lateral root-induction - NAA vs control",106,23328941,"MASCOT Score",34.0000000,,,,,,
IPSTSSQSARFENVFSSISSSPTK,ph,S,140,false,"TOR Kinase and ABA Receptor",100,29290610,XCorr,3.4041739,0.8042000,,,,0.023840000852942,
IPSTSSQSAR,ph,S,140,false,"atm and atr DNA damage response",88,25561503,"MASCOT Score",27.0000000,1.0000000,,,,,-0.9300000
IPSTSSQSAR,ph,S,140,false,"Protein sumoylation and phosphorylation cross-talk",97,28419593,,,,,,,,
IPSTSSQSAR,ph,S,140,false,"Tissue atlas Arabidopsis - ProteomicsDB",114,32188942,"MaxQuant score",164.4800000,0.9989930,,,,1.889060019522E-9,
FENVFSSISSSPTK,ph,S,149,false,"Tissue atlas Arabidopsis - ProteomicsDB",114,32188942,"MaxQuant score",136.0100000,0.9827900,,,,2.0023799152113E-5,
FENVFSSISSSPTKHR,ph,S,151,false,"MAPK Arabidopsis substrates",45,23172892,"MaxQuant Score",117.1800000,,,,,,
FENVFSSISSSPTK,ph,S,151,false,"Lateral root-induction - NAA vs control",106,23328941,"MASCOT Score",52.0000000,,,,,,
FENVFSSISSSPTKHR,ph,S,152,false,"MAPK Arabidopsis substrates",45,23172892,"MaxQuant Score",165.5800000,,,,,,
FENVFSSISSSPTK,ph,S,152,false,"MAPK Arabidopsis substrates",45,23172892,"MaxQuant Score",184.9800000,,,,,,
FENVFSSISSSPTK,ph,S,152,false,"BSK8 and BSL2 regulating sucrose-ph synthase",66,24924143,"MaxQuant Score",155.9200000,,,,,,0.2496500
FENVFSSISSSPTK,ph,S,152,false,"srk2dei ABA signaling phopshoproteomics",83,23572148,"MASCOT Score",61.0000000,,,,,,-0.0005000
FENVFSSISSSPTK,ph,S,152,false,"SIRK1 exp - sirk1 mutant vs WT",86b,23820729,,,,-1.6199714,,NO,,
FENVFSSISSSPTK,ph,S,152,false,"Brassinosteroid-Regulated Phosphorylation Dynamics",94,26187819,"MaxQuant Score",230.2900000,0.8170000,,,,0,1.8270000
FENVFSSISSSPTK,ph,S,152,false,"Lateral root-induction - NAA vs control",106,23328941,"MASCOT Score",40.0000000,,,,,,
FENVFSSISSSPTKHR,ph,S,153,false,"MAPK Arabidopsis substrates",45,23172892,"MaxQuant Score",125.5200000,,,,,,
FENVFSSISSSPTKHR,ph,S,153,false,"Phosphoproteome ethylene-regulated time response",46,24043427,"MASCOT Score",53.7500000,,,,,,-6.1246000
FENVFSSISSSPTK,ph,S,153,false,"Phytohormone-responsive phosphoproteins",34,20374526,"MASCOT Score",57.0000000,,,,,,1.1303100
FENVFSSISSSPTK,ph,S,153,false,"Large-scale phosphorylation discovery",44,23111157,XCorr,4.5450000,,,,,,
FENVFSSISSSPTK,ph,S,153,false,"MAPK Arabidopsis substrates",45,23172892,"MaxQuant Score",213.8300000,,,,,,
FENVFSSISSSPTK,ph,S,153,false,"Phosphoproteome ethylene-regulated time response",46,24043427,"MASCOT Score",45.4000000,,,,,,13.8459000
FENVFSSISSSPTK,ph,S,153,false,"PAMP-triggered phosphorylation",48,24601666,"MASCOT Score",73.0300000,,,,,,
FENVFSSISSSPTK,ph,S,153,false,"Tyrosine phosphorylation in Arabidopsis",59,18463617,"MASCOT Score",78.0000000,,,,,,-0.3729704
FENVFSSISSSPTK,ph,S,153,false,"BSK8 and BSL2 regulating sucrose-ph synthase",66,24924143,"MaxQuant Score",179.1000000,,,,,,1.5545000
FENVFSSISSSPTK,ph,S,153,false,"srk2dei ABA signaling phopshoproteomics",83,23572148,"MASCOT Score",84.0000000,,,,,,-0.0014000
FENVFSSISSSPTK,ph,S,153,false,"LAXIC - ABA stress",84a,23660473,XCorr,4.5100000,0.9990000,,,,0.0027653500437737,
FENVFSSISSSPTK,ph,S,153,false,"LAXIC - mannitol vs control",84b,23660473,XCorr,3.9900000,0.9720000,-1.3473707,,NO,0.00041881398647092,
FENVFSSISSSPTK,ph,S,153,false,"SnRK2 protein kinase substrates",85,23776212,XCorr,3.6442871,0.9830000,,,,3.3429801078455E-6,
FENVFSSISSSPTK,ph,S,153,false,"atm and atr DNA damage response",88,25561503,"MASCOT Score",34.0000000,0.9970000,,,,,0.2900000
FENVFSSISSSPTK,ph,S,153,false,"Brassinosteroid-Regulated Phosphorylation Dynamics",94,26187819,"MaxQuant Score",242.1000000,0.9010000,,,,0,1.6070000
FENVFSSISSSPTK,ph,S,153,false,"Protein sumoylation and phosphorylation cross-talk",97,28419593,,,,,,,,
FENVFSSISSSPTK,ph,S,153,false,"TOR Kinase and ABA Receptor",100,29290610,XCorr,4.8499417,0.9851000,,,,7.2100001489162E-6,
FENVFSSISSSPTK,ph,S,153,false,"Lateral root-induction - NAA vs control",106,23328941,"MASCOT Score",59.0000000,,,,,,
FENVFSSISSSPTK,ph,S,153,false,"Phospho cell culture sucrose/TOR",109,30833711,,,0.8596620,,,,,
FENVFSSISSSPTK,ph,S,153,false,"Tissue atlas Arabidopsis - ProteomicsDB",114,32188942,"MaxQuant score",279.1900000,0.8803220,,,,0,
FENVFSSISSSPTKHR,ph,T,155,false,"MAPK Arabidopsis substrates",45,23172892,"MaxQuant Score",87.3880000,,,,,,
FENVFSSISSSPTKHR,ph,T,155,false,"Phosphoproteome ethylene-regulated time response",46,24043427,"MASCOT Score",59.4800000,,,,,,-17.7788000
FENVFSSISSSPTK,ph,T,155,false,"MAPK Arabidopsis substrates",45,23172892,"MaxQuant Score",88.0870000,,,,,,
FENVFSSISSSPTK,ph,T,155,false,"srk2dei ABA signaling phopshoproteomics",83,23572148,"MASCOT Score",57.0000000,,,,,,0.0006000
FENVFSSISSSPTK,ph,T,155,false,"SIRK1 phosphorylation",86a,23820729,"MaxQuant Score",142.4000000,0.8440000,,,,0.0049999998882413,1.5250000
FENVFSSISSSPTK,ph,T,155,false,"Lateral root-induction - NAA vs control",106,23328941,"MASCOT Score",25.0000000,,,,,,
FENVFSSISSSPTK,ph,T,155,false,"Col-0 callus - FC Col-0 vs. Col-0 Xray",111a,31410901,,63.3600000,,0.2290723,0.0000000,NO,,0.7058390
FENVFSSISSSPTK,ph,T,155,false,"Col-0 X-ray callus - FC Col-0 vs. Col-0 Xray",111b,31410901,,63.3600000,,0.2290723,0.0000000,NO,,0.7058390
FENVFSSISSSPTK,ph,T,155,false,"atm callus - FC atm vs. atm Xray",111c,31410901,,63.3600000,,0.3682740,0.0000000,NO,,0.7058390
FENVFSSISSSPTK,ph,T,155,false,"atm-3 X-ray callus - FC atm vs. atm Xray",111d,31410901,,63.3600000,,0.3682740,0.0000000,NO,,0.7058390
FENVFSSISSSPTK,ph,T,155,false,"Tissue atlas Arabidopsis - ProteomicsDB",114,32188942,"MaxQuant score",217.6900000,0.7581300,,,,0,
KQNSSPFDDLMGNNLGK,ph,S,162,false,"SnRK2 protein kinase substrates",85,23776212,XCorr,4.4271903,0.9610000,,,,2.0330999177531E-5,
KQNSSPFDDLMGNNLGK,ph,S,162,false,"atm and atr DNA damage response",88,25561503,"MASCOT Score",49.0000000,0.9420000,,,,,0.3700000
KQNSSPFDDLMGNNLGK,ph,S,162,false,"Tissue atlas Arabidopsis - ProteomicsDB",114,32188942,"MaxQuant score",352.0500000,0.9999320,,,,0,
QNSSPFDDLMGNNLGK,ph,S,162,false,"srk2dei ABA signaling phopshoproteomics",83,23572148,"MASCOT Score",42.0000000,,,,,,-0.0016000
QNSSPFDDLMGNNLGK,ph,S,162,false,"atm and atr DNA damage response",88,25561503,"MASCOT Score",50.0000000,0.9950000,,,,,-0.1200000
QNSSPFDDLMGNNLGK,ph,S,162,false,"TOR Kinase and ABA Receptor",100,29290610,XCorr,4.3574076,0.9003000,,,,2.8609999844775E-6,
QNSSPFDDLMGNNLGK,ph,S,163,false,"Tissue atlas Arabidopsis - ProteomicsDB",114,32188942,"MaxQuant score",120.9200000,0.8209280,,,,5.8070401785792E-12,
TTSETTSQSQKPPYR,ph,S,208,true,"Tissue atlas Arabidopsis - ProteomicsDB",114,32188942,"MaxQuant score",78.0690000,0.9234730,,,,0.00054258498130366,
TTSETTSQSQKPPYR,ph,S,214,true,"Tissue atlas Arabidopsis - ProteomicsDB",114,32188942,"MaxQuant score",73.0570000,0.9108080,,,,0.00010051400022348,
SHLRPPGNISGSQSPVESSGLYHSK,ph,S,307,true,"Tissue atlas Arabidopsis - ProteomicsDB",114,32188942,"MaxQuant score",111.8100000,0.9770820,,,,8.8586802688203E-22,
SHLRPPGNISGSQSPVESSGLYHSK,ph,S,309,true,"TOR Kinase and ABA Receptor",100,29290610,XCorr,3.2357054,0.9664000,,,,0.00013270000636112,
SHLRPPGNISGSQSPVESSGLYHSK,ph,S,309,true,"Tissue atlas Arabidopsis - ProteomicsDB",114,32188942,"MaxQuant score",146.1000000,0.7594490,,,,7.286752014489E-44,
SHLRPPGNISGSQSPVESSGLYHSK,ph,S,311,true,"MAPK Arabidopsis substrates",45,23172892,"MaxQuant Score",85.0020000,,,,,,
SHLRPPGNISGSQSPVESSGLYHSK,ph,S,311,true,"TOR Kinase and ABA Receptor",100,29290610,XCorr,4.7327452,0.9947000,,,,1.1030000024448E-7,
SHLRPPGNISGSQSPVESSGLYHSK,ph,S,311,true,"Tissue atlas Arabidopsis - ProteomicsDB",114,32188942,"MaxQuant score",167.3400000,0.9999380,,,,0,
SHLRPPGNISGSQSPVESSGLYHSK,ph,S,315,true,"MAPK Arabidopsis substrates",45,23172892,"MaxQuant Score",106.9900000,,,,,,
SHLRPPGNISGSQSPVESSGLYHSK,ph,S,316,true,"MAPK Arabidopsis substrates",45,23172892,"MaxQuant Score",60.6210000,,,,,,
SHLRPPGNISGSQSPVESSGLYHSK,ph,S,321,true,"Tissue atlas Arabidopsis - ProteomicsDB",114,32188942,"MaxQuant score",102.5600000,0.9894970,,,,4.7977501232035E-17,
VNEPSIPTSAYHSHVPSSGR,ph,S,404,false,"Tissue atlas Arabidopsis - ProteomicsDB",114,32188942,"MaxQuant score",137.8600000,0.7676120,,,,4.3620802128003E-22,
ASVNSPTASQMDELDDFSIGR,ph,S,409,false,"SnRK2 protein kinase substrates",85,23776212,XCorr,3.2073429,0.9180000,,,,0.0066134198568761,
ASVNSPTASQMDELDDFSIGR,ph,S,409,false,"Lateral root-induction - NAA vs control",106,23328941,"MASCOT Score",40.0000000,,,,,,
ASVNSPTASQMDELDDFSIGR,ph,S,409,false,"Col-0 callus - FC Col-0 vs. Col-0 Xray",111a,31410901,,90.6700000,,-0.1603804,0.0000000,NO,,1.0195057
ASVNSPTASQMDELDDFSIGR,ph,S,409,false,"Col-0 X-ray callus - FC Col-0 vs. Col-0 Xray",111b,31410901,,90.6700000,,-0.1603804,0.0000000,NO,,1.0195057
ASVNSPTASQMDELDDFSIGR,ph,S,409,false,"atm callus - FC atm vs. atm Xray",111c,31410901,,90.6700000,,-0.2180934,0.0000000,NO,,1.0195057
ASVNSPTASQMDELDDFSIGR,ph,S,409,false,"atm-3 X-ray callus - FC atm vs. atm Xray",111d,31410901,,90.6700000,,-0.2180934,0.0000000,NO,,1.0195057
ASVNSPTASQMDELDDFSIGR,ph,S,409,false,"Tissue atlas Arabidopsis - ProteomicsDB",114,32188942,"MaxQuant score",114.5500000,0.9181050,,,,2.5844100080483E-13,
ASVNSPTASQMDELDDFSIGR,ph,S,412,false,"Arabidopsis root NAA phosphoproteome",18a,27643528,"MaxQuant Score",49.0940000,0.8300000,,,,0.00064390001352876,-1.6870000
ASVNSPTASQMDELDDFSIGR,ph,S,412,false,"Tyrosine phosphorylation in Arabidopsis",59,18463617,"MASCOT Score",93.0000000,,,,,,-2.4579912
ASVNSPTASQMDELDDFSIGR,ph,S,412,false,"srk2dei ABA signaling phopshoproteomics",83,23572148,"MASCOT Score",96.0000000,,,,,,-0.0032000
ASVNSPTASQMDELDDFSIGR,ph,S,412,false,"SnRK2 protein kinase substrates",85,23776212,XCorr,2.6940973,0.8220000,,,,7.3076598994248E-8,
ASVNSPTASQMDELDDFSIGR,ph,S,412,false,"atm and atr DNA damage response",88,25561503,"MASCOT Score",65.0000000,0.9870000,,,,,-0.6900000
ASVNSPTASQMDELDDFSIGR,ph,S,412,false,"Protein sumoylation and phosphorylation cross-talk",97,28419593,,,,,,,,
ASVNSPTASQMDELDDFSIGR,ph,S,412,false,"TOR Kinase and ABA Receptor",100,29290610,XCorr,4.9437928,0.8857000,,,,2.2309999621939E-5,
ASVNSPTASQMDELDDFSIGR,ph,S,412,false,"Lateral root-induction - NAA vs control",106,23328941,"MASCOT Score",90.0000000,,,,,,
ASVNSPTASQMDELDDFSIGR,ph,S,412,false,"Phospho cell culture sucrose/TOR",109,30833711,,,0.9998850,,,,,
ASVNSPTASQMDELDDFSIGR,ph,S,412,false,"Tissue atlas Arabidopsis - ProteomicsDB",114,32188942,"MaxQuant score",444.3300000,1.0000000,,,,0,
ASVNSPTASQMDELDDFSIGR,ph,T,414,false,"srk2dei ABA signaling phopshoproteomics",83,23572148,"MASCOT Score",44.0000000,,,,,,0.0009000
ASVNSPTASQMDELDDFSIGR,ph,T,414,false,"Lateral root-induction - NAA vs control",106,23328941,"MASCOT Score",29.0000000,,,,,,
ASVNSPTASQMDELDDFSIGR,ph,S,416,false,"Tissue atlas Arabidopsis - ProteomicsDB",114,32188942,"MaxQuant score",231.1200000,0.9999990,,,,0,
ASVNSPTASQMDELDDFSIGR,ph,S,425,false,"Tissue atlas Arabidopsis - ProteomicsDB",114,32188942,"MaxQuant score",174.7000000,1.0000000,,,,5.9325900915956E-37,
NQTAANGYPDPSSGEDSDVFSTAAASAAAMK,ph,S,440,false,"TOR Kinase and ABA Receptor",100,29290610,XCorr,4.6388292,0.8336000,,,,1.4780000128667E-5,
ASRSREGDHTENYDSR,ph,S,484,false,"TOR Kinase and ABA Receptor",100,29290610,XCorr,3.0514011,0.8493000,,,,0.002688999986276,
SREGDHTENYDSR,ph,S,486,false,"Tissue atlas Arabidopsis - ProteomicsDB",114,32188942,"MaxQuant score",84.3750000,0.9957360,,,,0.00014835399633739,
AAVGKVTDAR,ub,K,577,true,"Arabidopsis ubiquitination COFRADIC",40,26744219,"MaxQuant Score",87.5680000,1.0000000,,,,0.0020000000949949,0.4100000
EKAEKAAAEAR,ub,K,608,true,"Arabidopsis ubiquitination COFRADIC",40,26744219,"MaxQuant Score",41.2420000,0.9990000,,,,0.023000000044703,-0.1410000
QQQENNNDLDSFFNSVSRPSSVPR,ph,S,673,true,"TOR Kinase and ABA Receptor",100,29290610,XCorr,4.7827992,0.8352000,,,,0.025110000744462,
QQQENNNDLDSFFNSVSRPSSVPR,ph,S,673,true,"Tissue atlas Arabidopsis - ProteomicsDB",114,32188942,"MaxQuant score",180.7900000,0.9246130,,,,0,
QQQENNNDLDSFFNSVSRPSSVPR,ph,S,676,true,"MAPK Arabidopsis substrates",45,23172892,"MaxQuant Score",82.8850000,,,,,,
QQQENNNDLDSFFNSVSRPSSVPR,ph,S,676,true,"Lateral root-induction - NAA vs control",106,23328941,"MASCOT Score",29.0000000,,,,,,
QQQENNNDLDSFFNSVSRPSSVPR,ph,S,676,true,"Tissue atlas Arabidopsis - ProteomicsDB",114,32188942,"MaxQuant score",328.8300000,0.7911330,,,,0,
AKQQQENNNDLDSFFNSVSRPSSVPR,ph,S,677,true,"MAPK Arabidopsis substrates",45,23172892,"MaxQuant Score",51.6210000,,,,,,
QQQENNNDLDSFFNSVSRPSSVPR,ph,S,677,true,"srk2dei ABA signaling phopshoproteomics",83,23572148,"MASCOT Score",69.0000000,,,,,,0.0004000
QQQENNNDLDSFFNSVSRPSSVPR,ph,S,677,true,"Col-0 callus - FC Col-0 vs. Col-0 Xray",111a,31410901,,21.2700000,,0.4521212,0.0000000,NO,,1.0962575
QQQENNNDLDSFFNSVSRPSSVPR,ph,S,677,true,"Col-0 X-ray callus - FC Col-0 vs. Col-0 Xray",111b,31410901,,21.2700000,,0.4521212,0.0000000,NO,,1.0962575
QQQENNNDLDSFFNSVSRPSSVPR,ph,S,677,true,"atm callus - FC atm vs. atm Xray",111c,31410901,,21.2700000,,1.2109472,0.0000000,NO,,1.0962575
QQQENNNDLDSFFNSVSRPSSVPR,ph,S,677,true,"atm-3 X-ray callus - FC atm vs. atm Xray",111d,31410901,,21.2700000,,1.2109472,0.0000000,NO,,1.0962575
GGSFESSRPSSR,ph,S,698,true,"atm and atr DNA damage response",88,25561503,"MASCOT Score",28.0000000,0.9810000,,,,,-0.5700000
GGSFESSRPSSR,ph,S,698,true,"Tissue atlas Arabidopsis - ProteomicsDB",114,32188942,"MaxQuant score",76.3110000,0.9999450,,,,8.4617801121567E-7,
GGSFESSR,ph,S,698,false,"atm and atr DNA damage response",88,25561503,"MASCOT Score",33.0000000,1.0000000,,,,,0.3700000
AAKALAEKNER,ub,K,775,false,"Arabidopsis ubiquitination COFRADIC",40,26744219,"MaxQuant Score",84.1690000,1.0000000,,,,0.00035119999665767,-0.4600000
RWGAGKEGNLR,ub,K,807,false,"Protein ubiquitination during photomorphogenesis",3,28461270,,,,,,,,
ATLCIHPDK,sno,C,852,false,"hot5-4 / wildtype, FAT-switch S-nitrosoproteome",169,37277371,,,,0.3500088,0.0013081,NO,,
