Peptide,PTM,ModifiedAA,ModifiedPosition,PeptideUniqueToGene,ExperimentDesc,ExpID,PubmedID,ScoreType,IdentScore,LocProb,Log2FChange,PQ-val,QuantSig,PEP,MassErrorPPM
ADPYSFYNFE,nt,A,21,true,"N-terminal ChaFRADIC",92,26010716,"MASCOT Score",27.0900000,,,,,0.0034860000014305,
ADPYSFYNFE,nt,A,21,true,"Stromal N-terminome",96,26371235,"MASCOT Score",50.6600000,,,,,,
ADPYSFYNFE,nt,A,21,true,"Arg/N-end rule seed, prt6 vs. Wt",99,29168982,"MASCOT Score",37.0100000,,1.2530434,0.0451657,YES,0.0011990000493824,-1.2471605
ADPYSFYN,nt,A,21,true,"HUNTER N-terminome: legumain, GluC and trypsin",119,31951383,"MaxQuant score",110.6100000,,,,,,
FPGPTINVTTNENLVVNVR,ng,N,58,true,"Conserved N-glycosylation",74,22633491,"MaxQuant Score",242.5200000,1.0000000,,,,0,4.1690000
FPGPTINVTTNENLVVNVR,ng,N,58,true,"N-linked Glycan Micro-heterogeneity Arabidopsis",134,29237727,,,,,,,,
FPGPTINVTTNENLVVNVR,ng,N,58,true,"UDP-GlcNAc transporter glycopeptide analysis",135,30224661,,,,,,,3.7788132951418E-16,0.7000000
VSWQDGVLGTNCPIPPK,sno,C,100,true,"hot5-4 / wildtype, FAT-switch S-nitrosoproteome",169,37277371,,,,-0.0979238,0.2348040,NO,,
WNWTYEFQVK,ng,N,107,false,"Conserved N-glycosylation",74,22633491,"MaxQuant Score",65.5730000,1.0000000,,,,0.020999999716878,-0.5160000
WNWTYEFQVK,ng,N,107,false,"ER-associatied N-glycan degradation chilling stres",133,27558752,,,,,,,,
WNWTYEFQVK,ng,N,107,false,"N-linked Glycan Micro-heterogeneity Arabidopsis",134,29237727,,,,,,,,
WNWTYEFQVK,ng,N,107,false,"UDP-GlcNAc transporter glycopeptide analysis",135,30224661,,,,,,,2.8741257637743E-11,1.5000000
YNDTLVADGIDFETITVHPGK,ng,N,200,true,"Conserved N-glycosylation",74,22633491,"MaxQuant Score",245.5900000,1.0000000,,,,0,0.9110000
YNDTLVADGIDFETITVHPGK,ng,N,200,true,"N-glycan occupancy Arabidopsis glycoproteins",87,23994444,"Ladder score",52.0000000,,,,,,
YNDTLVADGIDFETITVHPGK,ng,N,200,true,"ER-associatied N-glycan degradation chilling stres",133,27558752,,,,,,,,
YNDTLVADGIDFETITVHPGK,ng,N,200,true,"N-linked Glycan Micro-heterogeneity Arabidopsis",134,29237727,,,,,,,,
YNDTLVADGIDFETITVHPGK,ng,N,200,true,"UDP-GlcNAc transporter glycopeptide analysis",135,30224661,,,,,,,3.1388717681699E-19,0.4000000
VVNETIWRR,ng,N,293,true,"Conserved N-glycosylation",74,22633491,"MaxQuant Score",164.2800000,1.0000000,,,,4.288000127417E-6,0.3570000
VVNETIWR,ng,N,293,true,"N-glycan occupancy Arabidopsis glycoproteins",87,23994444,"Ladder score",68.9000000,,,,,,
VVNETIWR,ng,N,293,true,"ER-associatied N-glycan degradation chilling stres",133,27558752,,,,,,,,
VVNETIWR,ng,N,293,true,"N-linked Glycan Micro-heterogeneity Arabidopsis",134,29237727,,,,,,,,
VVNETIWR,ng,N,293,true,"UDP-GlcNAc transporter glycopeptide analysis",135,30224661,,,,,,,1.338671609119E-5,0.3000000
WNVSASGARPNPQGSFK,ng,N,342,true,"Conserved N-glycosylation",74,22633491,"MaxQuant Score",233.3900000,1.0000000,,,,0,0.4760000
WNVSASGARPNPQGSFK,ng,N,342,true,"N-glycan occupancy Arabidopsis glycoproteins",87,23994444,"Ladder score",50.5000000,,,,,,
WNVSASGARPNPQGSFK,ng,N,342,true,"N-Glycopeptide Profiling in Arabidopsis Infloresce",132,27067053,"MOWSE score",41.1000000,,,,,4.0999999328051E-5,
WNVSASGARPNPQGSFK,ng,N,342,true,"N-linked Glycan Micro-heterogeneity Arabidopsis",134,29237727,,,,,,,,
WNVSASGARPNPQGSFK,ng,N,342,true,"UDP-GlcNAc transporter glycopeptide analysis",135,30224661,,,,,,,4.4309886951604E-16,0.3000000
WNVSASGAR,ng,N,342,true,"ER-associatied N-glycan degradation chilling stres",133,27558752,,,,,,,,
WNVSASGAR,ng,N,342,true,"UDP-GlcNAc transporter glycopeptide analysis",135,30224661,,,,,,,3.4802420145752E-7,-0.1000000
YGSINVTDVYVLR,ng,N,362,true,"Conserved N-glycosylation",74,22633491,"MaxQuant Score",170.4800000,1.0000000,,,,3.5799999319078E-26,0.9160000
YGSINVTDVYVLR,ng,N,362,true,"N-glycan occupancy Arabidopsis glycoproteins",87,23994444,"Ladder score",81.3000000,,,,,,
YGSINVTDVYVLR,ng,N,362,true,"ER-associatied N-glycan degradation chilling stres",133,27558752,,,,,,,,
YGSINVTDVYVLR,ng,N,362,true,"N-linked Glycan Micro-heterogeneity Arabidopsis",134,29237727,,,,,,,,
YGSINVTDVYVLR,ng,N,362,true,"UDP-GlcNAc transporter glycopeptide analysis",135,30224661,,,,,,,1.5812958652909E-17,0.3000000
NMPPVTISGKR,ac,K,380,true,"Quantitative Acetylproteomics",101,29440448,,,,,,,,
VATSIINGTYR,ng,N,430,true,"Conserved N-glycosylation",74,22633491,"MaxQuant Score",157.1100000,1.0000000,,,,9.9660001337721E-16,0.6840000
VATSIINGTYR,ng,N,430,true,"N-glycan occupancy Arabidopsis glycoproteins",87,23994444,"Ladder score",84.1000000,,,,,,
VATSIINGTYR,ng,N,430,true,"ER-associatied N-glycan degradation chilling stres",133,27558752,,,,,,,,
VATSIINGTYR,ng,N,430,true,"N-linked Glycan Micro-heterogeneity Arabidopsis",134,29237727,,,,,,,,
VATSIINGTYR,ng,N,430,true,"UDP-GlcNAc transporter glycopeptide analysis",135,30224661,,,,,,,5.246875850462E-12,0.6000000
GFMEVVLQNNDTK,ng,N,444,true,"N-glycan occupancy Arabidopsis glycoproteins",87,23994444,"Ladder score",73.3000000,,,,,,
GFMEVVLQNNDTK,ng,N,444,true,"ER-associatied N-glycan degradation chilling stres",133,27558752,,,,,,,,
GFMEVVLQNNDTK,ng,N,444,true,"N-linked Glycan Micro-heterogeneity Arabidopsis",134,29237727,,,,,,,,
GFMEVVLQNNDTK,ng,N,444,true,"UDP-GlcNAc transporter glycopeptide analysis",135,30224661,,,,,,,2.4971833628706E-11,0.5000000
VVNPDENNKTEFGHPDNVLYCGALSK,ng,N,534,true,"Conserved N-glycosylation",74,22633491,"MaxQuant Score",237.6900000,0.8700000,,,,0,1.9180000
VVNPDENNKTEFGHPDNVLYCGALSK,ng,N,534,true,"ER-associatied N-glycan degradation chilling stres",133,27558752,,,,,,,,
VVNPDENNKTEFGHPDNVLYCGALSK,ng,N,534,true,"N-linked Glycan Micro-heterogeneity Arabidopsis",134,29237727,,,,,,,,
VVNPDENNKTEFGHPDNVLYCGALSK,ng,N,534,true,"UDP-GlcNAc transporter glycopeptide analysis",135,30224661,,,,,,,1.8557527239576E-20,0.7000000
TEFGHPDNVLYCGALSK,sno,C,547,true,"hot5-4 / wildtype, FAT-switch S-nitrosoproteome",169,37277371,,,,-0.2101143,0.1803214,NO,,
