Peptide,PTM,ModifiedAA,ModifiedPosition,PeptideUniqueToGene,ExperimentDesc,ExpID,PubmedID,ScoreType,IdentScore,LocProb,Log2FChange,PQ-val,QuantSig,PEP,MassErrorPPM
AEEAKSKGNAAFSSG,nta,A,2,true,"Arabidopsis translation initiation landscape - NTA",167a,35069635,,,,,,,,
SNPFVDAFQGK,ph,S,122,true,"srk2dei ABA signaling phopshoproteomics",83,23572148,"MASCOT Score",30.0000000,,,,,,0.0007000
SDFKMIAR,ub,K,302,true,"Arabidopsis ubiquitination COFRADIC",40,26744219,"MaxQuant Score",44.3490000,1.0000000,,,,0.030999999493361,0.7480000
KGSALVKMAR,ub,K,317,true,"Arabidopsis ubiquitination COFRADIC",40,26744219,"MaxQuant Score",63.6240000,1.0000000,,,,0.003000000026077,0.0980000
AACYTK,so,C,412,false,"S-sulfenylation site detection using YAP1C",110,32714340,,,,,,,,
RCVEQINK,so,C,480,true,"Arabidopsis S-sulfenylation chemoproteomics",108,31578252,"pFind PSM Score",0.1718650,,2.0833300,,,,1.3028783
CVEQINKASR,ub,K,486,true,"Arabidopsis ubiquitination COFRADIC",40,26744219,"MaxQuant Score",69.7210000,1.0000000,,,,0.0060000000521541,-0.0910000
GDLTPEELKER,ph,T,493,false,"Ethylene-regulated phosphorylation ein2 mutant",30,19253305,"MASCOT Score",26.9841000,,,,,,11.2629330
GDLTPEELKER,ph,T,493,false,"Pollen phosphoproteome Arabidopsis",43,22631563,"MASCOT Score",54.2500000,,,,,,
GDLTPEELKER,ph,T,493,false,"Phosphoproteome ethylene-regulated time response",46,24043427,"MASCOT Score",57.4900000,,,,,,1.2303000
GDLTPEELKER,ph,T,493,false,"SnRK2 protein kinase substrates",85,23776212,XCorr,2.2487879,1.0000000,,,,0.0051128999330103,
GDLTPEELKER,ph,T,493,false,"atm and atr DNA damage response",88,25561503,"MASCOT Score",44.0000000,1.0000000,,,,,-0.2200000
GDLTPEELKER,ph,T,493,false,"Phospho cell culture sucrose/TOR",109,30833711,,,1.0000000,,,,,
GDLTPEELKER,ph,T,493,false,"Col-0 callus - FC Col-0 vs. Col-0 Xray",111a,31410901,,32.3900000,,0.0789791,0.0000000,NO,,0.5740936
GDLTPEELKER,ph,T,493,false,"Col-0 X-ray callus - FC Col-0 vs. Col-0 Xray",111b,31410901,,32.3900000,,0.0789791,0.0000000,NO,,0.5740936
GDLTPEELKER,ph,T,493,false,"atm callus - FC atm vs. atm Xray",111c,31410901,,32.3900000,,-0.9355455,0.0000000,NO,,0.5740936
GDLTPEELKER,ph,T,493,false,"atm-3 X-ray callus - FC atm vs. atm Xray",111d,31410901,,32.3900000,,-0.9355455,0.0000000,NO,,0.5740936
GDLTPEELKER,ph,T,493,false,"Tissue atlas Arabidopsis - ProteomicsDB",114,32188942,"MaxQuant score",215.5100000,1.0000000,,,,1.5606999704554E-31,
GDLTPEELK,ph,T,493,false,"Tyrosine phosphorylation in Arabidopsis",59,18463617,"MASCOT Score",34.0000000,,,,,,-0.7404163
GDLTPEELK,ph,T,493,false,"srk2dei ABA signaling phopshoproteomics",83,23572148,"MASCOT Score",20.0000000,,,,,,0.0006000
GDLTPEELK,ph,T,493,false,"atm and atr DNA damage response",88,25561503,"MASCOT Score",39.0000000,1.0000000,,,,,-1.3400000
GDLTPEELKER,ac,K,498,false,"Quantitative Acetylproteomics",101,29440448,,,,,,,,
GDLTPEELKER,ub,K,498,false,"Arabidopsis ubiquitination COFRADIC",40,26744219,"MaxQuant Score",113.2200000,1.0000000,,,,6.7840000284036E-9,0.2110000
QAKAMQDPEVQNILSDPVMR,me1,K,503,true,"Arabidopsis protein methylome",123,31809900,"MaxQuant Score",75.5330000,1.0000000,,,,2.1573900443883E-9,1.3851000
QAKAMQDPEVQNILSDPVMR,me2,K,503,true,"Arabidopsis protein methylome",123,31809900,"MaxQuant Score",193.2700000,1.0000000,,,,0,-0.3346700
