Peptide,PTM,ModifiedAA,ModifiedPosition,PeptideUniqueToGene,ExperimentDesc,ExpID,PubmedID,ScoreType,IdentScore,LocProb,Log2FChange,PQ-val,QuantSig,PEP,MassErrorPPM
VLNMESTGEAVR,nt,V,2,true,"Arg/N-end rule pathway Roots",80,25728785,"MASCOT Score",57.6300000,,,,,0.0011670000385493,
VLNMESTGEAVR,nt,V,2,true,"Arg/N-end rule seed, prt6 vs. Wt",99,29168982,"MASCOT Score",24.5400000,,-0.2633013,0.2252868,NO,0.11519999802113,-1.9118880
MESTGEAVR,nta,M,5,true,"Arabidopsis translation initiation landscape - NTA",167a,35069635,,,,,,,,
STTGNDGGITVVR,ph,T,16,true,"Tissue atlas Arabidopsis - ProteomicsDB",114,32188942,"MaxQuant score",139.8600000,0.9996660,,,,7.307070063689E-6,
SDAPSDFHVAQR,og,S,27,true,"O-GlcNac Inflorescence Tissue",81,28154133,"MASCOT Score",29.2000000,,,,,,3.7000000
STTGNDGGITVVRSDAPSDFHVAQR,ph,S,27,true,"Tissue atlas Arabidopsis - ProteomicsDB",114,32188942,"MaxQuant score",207.7000000,0.9898890,,,,0,
SDAPSDFHVAQR,ph,S,31,true,"Tissue atlas Arabidopsis - ProteomicsDB",114,32188942,"MaxQuant score",146.3700000,1.0000000,,,,1.1245999758103E-6,
KYGPDGTVVALSPK,ph,S,108,true,"Tissue atlas Arabidopsis - ProteomicsDB",114,32188942,"MaxQuant score",255.1500000,1.0000000,,,,0,
VKPTNSFNR,ph,S,145,true,"Phospho cell culture sucrose/TOR",109,30833711,,,0.9987970,,,,,
VKPTNSFNR,ph,S,145,true,"Tissue atlas Arabidopsis - ProteomicsDB",114,32188942,"MaxQuant score",129.8200000,0.9998010,,,,7.3369403253309E-5,
QPDSSGGTLTYEGRFEILSLSGSFMPNDSGGTR,ph,S,218,true,"Conserved plant phosphoproteome - Arabidopsis",61a,20466843,"MASCOT Score",24.0000000,1.0000000,,,,,
HDFMLSSPTAAIPISSAADHR,ph,S,307,true,"Tissue atlas Arabidopsis - ProteomicsDB",114,32188942,"MaxQuant score",140.6700000,0.9186970,,,,2.374390072042E-23,
TIHSVSSLPVNNNTWQTSLASDPR,ph,S,328,true,"Tissue atlas Arabidopsis - ProteomicsDB",114,32188942,"MaxQuant score",199.2700000,0.8679390,,,,0,
TIHSVSSLPVNNNTWQTSLASDPR,ph,S,342,true,"Tissue atlas Arabidopsis - ProteomicsDB",114,32188942,"MaxQuant score",153.1800000,0.9933930,,,,2.2420775429197E-44,
