Peptide,PTM,ModifiedAA,ModifiedPosition,PeptideUniqueToGene,ExperimentDesc,ExpID,PubmedID,ScoreType,IdentScore,LocProb,Log2FChange,PQ-val,QuantSig,PEP,MassErrorPPM
AYHPAYTETMSMGGGSSHGGGQQYVPFATSSGSLR,nta,A,2,true,"HUNTER N-terminome: legumain, GluC and trypsin",119,31951383,"MaxQuant score",48.0850000,,,,,,
AYHPAYTETMSMGGGSSHGGGQQYVPFATSSGSLR,ph,T,10,true,"Tissue atlas Arabidopsis - ProteomicsDB",114,32188942,"MaxQuant score",188.4900000,0.8277950,,,,0,
AYHPAYTETMSMGGGSSHGGGQQYVPFATSSGSLR,ph,S,12,true,"Tissue atlas Arabidopsis - ProteomicsDB",114,32188942,"MaxQuant score",195.4200000,0.8061890,,,,0,
AYHPAYTETMSMGGGSSHGGGQQYVPFATSSGSLR,ph,S,17,true,"Tissue atlas Arabidopsis - ProteomicsDB",114,32188942,"MaxQuant score",359.6600000,0.9776330,,,,0,
LGGMLSGLGRK,ph,S,69,true,"TOR Kinase and ABA Receptor",100,29290610,XCorr,2.4283569,1.0000000,,,,0.068039998412132,
LGGMLSGLGR,ph,S,69,true,"atm and atr DNA damage response",88,25561503,"MASCOT Score",62.0000000,1.0000000,,,,,0.3900000
LGGMLSGLGR,ph,S,69,true,"TOR Kinase and ABA Receptor",100,29290610,XCorr,3.7507036,1.0000000,,,,0.00011329999688314,
LGGMLSGLGR,ph,S,69,true,"Tissue atlas Arabidopsis - ProteomicsDB",114,32188942,"MaxQuant score",143.0000000,1.0000000,,,,6.0269502455412E-7,
EVPVGTVSVYNSPR,ph,Y,678,true,"Lateral root-induction - NAA vs control",106,23328941,"MASCOT Score",25.0000000,,,,,,
EVPVGTVSVYNSPR,ph,S,680,true,"Arabidopsis root NAA phosphoproteome",18a,27643528,"MaxQuant Score",87.4110000,0.9980000,,,,1.5710000411673E-8,0.1960000
EVPVGTVSVYNSPR,ph,S,680,true,"Phosphorylation nuclei-enriched fractions",28,19245862,,,,,,,,
EVPVGTVSVYNSPR,ph,S,680,true,"STN8 phosphoproteome",38,21768351,"MASCOT Score",92.2500000,,,,,,-1.1518400
EVPVGTVSVYNSPR,ph,S,680,true,"Pollen phosphoproteome Arabidopsis",43,22631563,"MASCOT Score",85.9300000,,,,,,-1.7954700
EVPVGTVSVYNSPR,ph,S,680,true,"Large-scale phosphorylation discovery",44,23111157,XCorr,4.5780000,,,,,,
EVPVGTVSVYNSPR,ph,S,680,true,"Chloroplast kinase substrates",60,19376835,"MASCOT Score",59.1500000,,,,,,-0.7101310
EVPVGTVSVYNSPR,ph,S,680,true,"srk2dei ABA signaling phopshoproteomics",83,23572148,"MASCOT Score",86.0000000,,,,,,0.0011000
EVPVGTVSVYNSPR,ph,S,680,true,"LAXIC - ABA stress",84a,23660473,XCorr,4.0700000,1.0000000,,,,6.1499997627834E-7,
EVPVGTVSVYNSPR,ph,S,680,true,"SnRK2 protein kinase substrates",85,23776212,XCorr,3.2246666,1.0000000,,,,0.00020182800653856,
EVPVGTVSVYNSPR,ph,S,680,true,"atm and atr DNA damage response",88,25561503,"MASCOT Score",88.0000000,1.0000000,,,,,0.0300000
EVPVGTVSVYNSPR,ph,S,680,true,"TOR Kinase and ABA Receptor",100,29290610,XCorr,3.9455431,0.9928000,,,,2.1939999328424E-7,
EVPVGTVSVYNSPR,ph,S,680,true,"Lateral root-induction - NAA vs control",106,23328941,"MASCOT Score",45.0000000,,,,,,
EVPVGTVSVYNSPR,ph,S,680,true,"Phosphorylation tonoplast membrane fraction",107,18686298,"MASCOT Score",67.0000000,,,,,,
EVPVGTVSVYNSPR,ph,S,680,true,"Col-0 callus - FC Col-0 vs. Col-0 Xray",111a,31410901,,78.7300000,,-0.0378463,0.0000000,NO,,0.1429841
EVPVGTVSVYNSPR,ph,S,680,true,"Col-0 X-ray callus - FC Col-0 vs. Col-0 Xray",111b,31410901,,78.7300000,,-0.0378463,0.0000000,NO,,0.1429841
EVPVGTVSVYNSPR,ph,S,680,true,"atm callus - FC atm vs. atm Xray",111c,31410901,,78.7300000,,0.0737274,0.0000000,NO,,0.1429841
EVPVGTVSVYNSPR,ph,S,680,true,"atm-3 X-ray callus - FC atm vs. atm Xray",111d,31410901,,78.7300000,,0.0737274,0.0000000,NO,,0.1429841
EVPVGTVSVYNSPR,ph,S,680,true,"Tissue atlas Arabidopsis - ProteomicsDB",114,32188942,"MaxQuant score",224.6700000,0.9999860,,,,0,
QLSELNWR,nt,Q,795,false,"HUNTER N-terminome: legumain, GluC and trypsin",119,31951383,"MaxQuant score",93.1950000,,,,,,
VSSLPGCETFPDLGGK,ox,C,835,false,"SPEAR - 10 mM H2O2 / mock",138a,34619326,,,,3.6594784,0.0047573,YES,,
