Peptide,PTM,ModifiedAA,ModifiedPosition,PeptideUniqueToGene,ExperimentDesc,ExpID,PubmedID,ScoreType,IdentScore,LocProb,Log2FChange,PQ-val,QuantSig,PEP,MassErrorPPM
TTSCTTAPELVEENER,ph,S,222,true,"LAXIC - ABA stress",84a,23660473,XCorr,3.9200000,0.8550000,,,,9.0200001068297E-6,
TTSCTTAPELVEENER,ph,S,222,true,"SnRK2 protein kinase substrates",85,23776212,XCorr,3.3847086,0.9220000,,,,3.5853200408553E-9,
TTSCTTAPELVEENER,ph,S,222,true,"atm and atr DNA damage response",88,25561503,"MASCOT Score",66.0000000,0.9880000,,,,,-0.6600000
TTSCTTAPELVEENER,ph,S,222,true,"TOR Kinase and ABA Receptor",100,29290610,XCorr,3.8979690,0.8411000,,,,4.4909997996001E-6,
TTSCTTAPELVEENER,ph,S,222,true,"Tissue atlas Arabidopsis - ProteomicsDB",114,32188942,"MaxQuant score",171.8100000,0.9992950,,,,2.6200899373708E-19,
LGEDLTPR,ph,T,312,true,"atm and atr DNA damage response",88,25561503,"MASCOT Score",30.0000000,1.0000000,,,,,-1.3400000
LGEDLTPR,ph,T,312,true,"Tissue atlas Arabidopsis - ProteomicsDB",114,32188942,"MaxQuant score",126.7100000,1.0000000,,,,0.0081168403849006,
EAAAQEGEQSSDVK,ph,S,352,true,"atm and atr DNA damage response",88,25561503,"MASCOT Score",75.0000000,0.9720000,,,,,-0.2500000
EAAAQEGEQSSDVK,ph,S,352,true,"Tissue atlas Arabidopsis - ProteomicsDB",114,32188942,"MaxQuant score",157.3500000,0.8480810,,,,2.023770040438E-10,
EAAAQEGEQSSDVK,ph,S,353,true,"Tissue atlas Arabidopsis - ProteomicsDB",114,32188942,"MaxQuant score",151.0300000,0.8516940,,,,2.0564800706779E-7,
AEPMEENNSGNHNGSWLELGK,ph,S,365,true,"Tissue atlas Arabidopsis - ProteomicsDB",114,32188942,"MaxQuant score",112.8600000,0.9997380,,,,3.1651200757543E-13,
