Peptide,PTM,ModifiedAA,ModifiedPosition,PeptideUniqueToGene,ExperimentDesc,ExpID,PubmedID,ScoreType,IdentScore,LocProb,Log2FChange,PQ-val,QuantSig,PEP,MassErrorPPM
AIDLDPNCAAFFADR,sno,C,35,true,"Site-specific nitrosomeproteomic id - gsnor1-3",90a,25699590,XCorr,3.2736454,,,,,3.2939999073278E-5,-6.1251368
AIDLDPNCAAFFADR,sno,C,35,true,"Site-specific nitrosomeproteomic id - gsnor1-3",90b,25699590,XCorr,3.4943593,,,,,0.1089000031352,-6.4755893
AIDLDPNCAAFFADR,so,C,35,true,"S-sulfenylation site detection using YAP1C",110,32714340,,,,,,,,
CRFEVLSTK,so,C,221,true,"S-sulfenylation site detection using YAP1C",110,32714340,,,,,,,,
LDGDAAMNK,mox,M,300,true,"cat2 Methionine oxidation - 1h stress",62a,25693801,"MASCOT Score",47.0000000,,0.5355207,,NO,,
LDGDAAMNK,mox,M,300,true,"cat2 Methionine oxidation - 3h stress",62b,25693801,"MASCOT Score",36.0000000,,0.1876678,,NO,,
SFAESNGTVLSTNWK,ph,S,322,true,"srk2dei ABA signaling phopshoproteomics",83,23572148,"MASCOT Score",56.0000000,,,,,,0.0001000
SFAESNGTVLSTNWK,ph,S,322,true,"Tissue atlas Arabidopsis - ProteomicsDB",114,32188942,"MaxQuant score",130.4700000,1.0000000,,,,1.6423000204213E-7,
SFAESNGTVLSTNWK,ng,N,327,true,"N-Glycopeptide Profiling in Arabidopsis Infloresce",132,27067053,"MOWSE score",26.8000000,,,,,9.1000001702923E-5,
KVESTPPDGMELK,mox,M,351,true,"cat2 Methionine oxidation - 1h stress",62a,25693801,"MASCOT Score",53.0000000,,-0.2639526,,NO,,
