Peptide,PTM,ModifiedAA,ModifiedPosition,PeptideUniqueToGene,ExperimentDesc,ExpID,PubmedID,ScoreType,IdentScore,LocProb,Log2FChange,PQ-val,QuantSig,PEP,MassErrorPPM
ADEHKHEESSPNLDPAVEVVER,nt,A,2,true,"Arg/N-end rule seed, prt6 vs. Wt",99,29168982,"MASCOT Score",49.8600000,,,,,0.00044000000343658,-1.9330759
ADEHKHEESSPNLDPAVEVVER,nta,A,2,true,"Arg/N-end rule seed, prt6 vs. Wt",99,29168982,"MASCOT Score",49.8600000,,0.7729008,0.0770743,NO,0.00044000000343658,-1.9330759
ADEHKHEESSPNLDPAVEVVER,nta,A,2,true,"FtsH12 N-terminome: WT / FtsH12 knockdown miRNA",118,33216923,"MaxQuant score",106.2900000,,,,,0.0054649999365211,
ADEHKHEESSPNLDPAVEVVER,nta,A,2,true,"Arabidopsis translation initiation landscape - NTA",167a,35069635,,,,,,,,
SSPNLDPAVE,nt,S,10,true,"N-terminal ChaFRADIC",92,26010716,"MASCOT Score",53.6600000,,,,,0.011040000244975,
ADEHKHEESSPNLDPAVEVVER,ph,S,10,true,"Tissue atlas Arabidopsis - ProteomicsDB",114,32188942,"MaxQuant score",212.9000000,1.0000000,,,,0,
ADEHKHEESSPNLDPAVEVVER,ph,S,11,true,"Tissue atlas Arabidopsis - ProteomicsDB",114,32188942,"MaxQuant score",354.8800000,1.0000000,,,,0,
HEESSPNLDPAVEVVER,ph,S,11,true,"TOR Kinase and ABA Receptor",100,29290610,XCorr,3.8318963,0.8695000,,,,2.5050001113414E-6,
ESLMEKLSEK,ph,S,31,true,"Tissue atlas Arabidopsis - ProteomicsDB",114,32188942,"MaxQuant score",243.4000000,1.0000000,,,,0,
GDSSSSSSSDDENEK,ph,S,41,true,"atm and atr DNA damage response",88,25561503,"MASCOT Score",37.0000000,0.9800000,,,,,0.6900000
SSSSSPKSLK,ac,K,60,true,"Quantitative Acetylproteomics",101,29440448,,,,,,,,
