Peptide,PTM,ModifiedAA,ModifiedPosition,PeptideUniqueToGene,ExperimentDesc,ExpID,PubmedID,ScoreType,IdentScore,LocProb,Log2FChange,PQ-val,QuantSig,PEP,MassErrorPPM
MNDGDVSRQIQQ,nta,M,1,true,"Arg/N-end rule seed, prt6 vs. Wt",99,29168982,"MASCOT Score",63.1400000,,,,,2.4300000234234E-8,-1.3628003
MNDGDVSRQIQ,nta,M,1,true,"Arg/N-end rule seed, prt6 vs. Wt",99,29168982,"MASCOT Score",26.5800000,,,,,0.054320000112057,-2.3372969
MNDGDVSRQI,nta,M,1,true,"N-term acetylation drought responses",5,26184543,,,,,,,,
MNDGDVSRQ,nta,M,1,true,"Arg/N-end rule seed, prt6 vs. Wt",99,29168982,"MASCOT Score",32.9900000,,,,,0.034749999642372,2.8291697
MNDGDVSR,nta,M,1,true,"Characterization plant N-terminal acetylation",6,22223895,"MASCOT Score",59.8600000,,,,,,
MNDGDVSR,nta,M,1,true,"Arg/N-end rule pathway Roots",80,25728785,"MASCOT Score",53.8100000,,,,,0.0017030000453815,
MNDGDVSR,nta,M,1,true,"Arg/N-end rule seed, prt6 vs. Wt",99,29168982,"MASCOT Score",49.5400000,,,,,0.094899997115135,0.0044996
LQLVEAEKKK,ac,K,48,false,"Quantitative Acetylproteomics",101,29440448,,,,,,,,
IRQDYEKK,ac,K,57,true,"Quantitative Acetylproteomics",101,29440448,,,,,,,,
QDYEKKEKQADVR,ub,K,58,true,"Arabidopsis ubiquitination COFRADIC",40,26744219,"MaxQuant Score",80.6320000,0.8040000,,,,2.3450000298908E-5,-0.8370000
QDYEKKEKQADVR,ub,K,60,true,"Arabidopsis ubiquitination COFRADIC",40,26744219,"MaxQuant Score",41.6210000,0.9850000,,,,0.0040000001899898,-0.3730000
VLQAQDDIVNAMKDQAAK,ub,K,93,true,"upl3 mutant / wildtype",168,35926874,"MaxQuant score",81.7130000,1.0000000,-0.3004484,,,1.0497399671294E-5,1.0122000
DQAAKDLLNVSR,ub,K,98,true,"upl3 mutant / wildtype",168,35926874,"MaxQuant score",90.4120000,1.0000000,1.2338881,0.1365370,NO,0.00028809200739488,-0.6515300
DLIVQCLLR,acy,C,121,false,"Arabidopsis S-acylation atlas - Meristem",163a,35681017,,,,,,,,
DLIVQCLLR,acy,C,121,false,"Arabidopsis S-acylation atlas - Hypocotyl",163b,35681017,,,,,,,,
DLIVQCLLR,acy,C,121,false,"Arabidopsis S-acylation atlas - Leaf",163c,35681017,,,,,,,,
LKEPSVLLR,ub,K,126,false,"Arabidopsis ubiquitination COFRADIC",40,26744219,"MaxQuant Score",80.6880000,1.0000000,,,,0.0080000003799796,-0.3280000
CREEDLGLVEAVLDDAKEEYAGK,so,C,134,true,"S-sulfenylation site detection using YAP1C",110,32714340,,,,,,,,
EEYAGKAK,ac,K,156,true,"Quantitative Acetylproteomics",101,29440448,,,,,,,,
AKVHAPEVAVDTK,ub,K,158,true,"upl3 mutant / wildtype",168,35926874,"MaxQuant score",135.0200000,1.0000000,-0.4799550,0.0928150,NO,4.5096300027581E-9,0.4507600
VHAPEVAVDTKIFLPPPPK,ub,K,169,true,"upl3 mutant / wildtype",168,35926874,"MaxQuant score",71.6850000,1.0000000,0.5916794,0.5049000,NO,2.6332099878346E-5,1.3091000
IFLPPPPKSNDPHGLHCSGGVVLASR,ub,K,177,true,"upl3 mutant / wildtype",168,35926874,"MaxQuant score",99.0640000,1.0000000,1.5185351,,,6.2367000452923E-11,-0.2408000
SNDPHGLHCSGGVVLASR,ox,C,186,true,"SPEAR - 50 mM H2O2 / mock",138b,34619326,,,,-1.2182643,0.0152287,YES,,
SNDPHGLHCSGGVVLASR,so,C,186,true,"S-sulfenylation site detection using YAP1C",110,32714340,,,,,,,,
DGKIVCENTLDAR,ub,K,198,false,"Arabidopsis ubiquitination COFRADIC",40,26744219,"MaxQuant Score",147.2600000,1.0000000,,,,1.7430000029994E-23,0.3310000
DGKIVCENTLDAR,ub,K,198,false,"upl3 mutant / wildtype",168,35926874,"MaxQuant score",77.7760000,1.0000000,1.0655723,0.1398780,NO,0.00032229701173492,1.5170000
IVCENTLDAR,ox,C,201,false,"OxiTRAQ Arabidopsis - 5 mM H2O2 versus control",47,24376095,,,,-0.0968183,0.3021794,NO,,
IVCENTLDAR,ox,C,201,false,"SPEAR - 50 mM H2O2 / mock",138b,34619326,,,,0.9889859,0.0251649,YES,,
IVCENTLDAR,sno,C,201,false,"Endogenous S-nitrosylation in Arabidopsis",64,22115780,"MASCOT Score",40.0000000,,,,,,
IVCENTLDAR,sno,C,201,false,"Cold stress nitrosylation - 4°C vs 22°C",65,24388526,,,,,,,,
IVCENTLDAR,sno,C,201,false,"Site-specific nitrosomeproteomic id - gsnor1-3",90a,25699590,XCorr,2.5380538,,,,,0.0020089999306947,-7.1515034
IVCENTLDAR,sno,C,201,false,"S-Nitroso-Proteome guard cells - 15 min flg22",116a,32121556,,,,1.5558162,0.0010000,YES,,
IVCENTLDAR,sno,C,201,false,"S-Nitroso-Proteome guard cells - 60 min flg22",116c,32121556,,,,1.3504972,0.0030000,YES,,
IVCENTLDAR,sno,C,201,false,"hot5-4 / wildtype, FAT-switch S-nitrosoproteome",169,37277371,,,,-0.1665678,0.3451288,NO,,
IVCENTLDAR,so,C,201,false,"S-sulfenylation site detection using YAP1C",110,32714340,,,,,,,,
KSLFGQVTA,ub,K,222,true,"upl3 mutant / wildtype",168,35926874,"MaxQuant score",90.6960000,1.0000000,0.7189643,,,0.020393999293447,-0.2324700
