Peptide,PTM,ModifiedAA,ModifiedPosition,PeptideUniqueToGene,ExperimentDesc,ExpID,PubmedID,ScoreType,IdentScore,LocProb,Log2FChange,PQ-val,QuantSig,PEP,MassErrorPPM
PAMPGLVSVKTPSDTPPLR,nt,P,2,true,"Arabidopsis translation initiation landscape - NT",167b,35069635,,,,,,,,
AMPGLVSVKTPSDTPPLR,nta,A,3,true,"Arabidopsis translation initiation landscape - NTA",167a,35069635,,,,,,,,
PAMPGLVSVKTPSDTPPLR,ph,T,12,true,"Tissue atlas Arabidopsis - ProteomicsDB",114,32188942,"MaxQuant score",104.8100000,0.9720930,,,,1.0152400164998E-7,
TPSDTPPLR,ph,T,12,true,"atm and atr DNA damage response",88,25561503,"MASCOT Score",25.0000000,1.0000000,,,,,0.7700000
TPSDTPPLR,ph,S,14,true,"TOR Kinase and ABA Receptor",100,29290610,XCorr,3.1048646,1.0000000,,,,0.0035119999665767,
TPSDTPPLR,ph,S,14,true,"Tissue atlas Arabidopsis - ProteomicsDB",114,32188942,"MaxQuant score",185.3300000,0.9999970,,,,4.6301499878609E-7,
TPSDTPPLR,ph,T,16,true,"Lateral root-induction - NAA vs control",106,23328941,"MASCOT Score",36.0000000,,,,,,
TPSDTPPLR,ph,T,16,true,"Tissue atlas Arabidopsis - ProteomicsDB",114,32188942,"MaxQuant score",139.8600000,0.9999040,,,,0.00045990900252946,
VAVPDTQPLSNPPR,ph,S,30,true,"Tissue atlas Arabidopsis - ProteomicsDB",114,32188942,"MaxQuant score",126.0200000,0.9989280,,,,5.8121401842835E-15,
VAVPDTQPLSNPPRTPMKK,ph,T,35,true,"STN8 phosphoproteome",38,21768351,"MASCOT Score",48.3300000,,,,,,
VAVPDTQPLSNPPRTPMKK,ph,T,35,true,"PAMP-triggered phosphorylation",48,24601666,"MASCOT Score",44.1300000,,,,,,
VAVPDTQPLSNPPRTPMKK,ph,T,35,true,"Chloroplast kinase substrates",60,19376835,"MASCOT Score",43.9100000,,,,,,-0.4681990
VAVPDTQPLSNPPRTPMK,ph,T,35,true,"atm and atr DNA damage response",88,25561503,"MASCOT Score",27.0000000,1.0000000,,,,,-0.3400000
VAVPDTQPLSNPPRTPMK,ph,T,35,true,"TOR Kinase and ABA Receptor",100,29290610,XCorr,4.3716621,1.0000000,,,,1.9040000552195E-5,
VAVPDTQPLSNPPRTPMK,ph,T,35,true,"Phospho cell culture sucrose/TOR",109,30833711,,,0.9764380,,,,,
VAVPDTQPLSNPPRTPMK,ph,T,35,true,"Tissue atlas Arabidopsis - ProteomicsDB",114,32188942,"MaxQuant score",179.1700000,0.9999990,,,,3.1362998580249E-36,
TPMKKTPSSTPSR,ph,T,40,true,"Tissue atlas Arabidopsis - ProteomicsDB",114,32188942,"MaxQuant score",148.7000000,0.9994580,,,,5.7065099099418E-6,
KTPSSTPSR,ph,T,40,true,"atm and atr DNA damage response",88,25561503,"MASCOT Score",36.0000000,0.9930000,,,,,-0.8700000
KTPSSTPSR,ph,S,42,true,"atm and atr DNA damage response",88,25561503,"MASCOT Score",28.0000000,0.9430000,,,,,1.0300000
TPSSTPSR,ph,S,42,true,"atm and atr DNA damage response",88,25561503,"MASCOT Score",25.0000000,0.9770000,,,,,0.0700000
KTPSSTPSR,ph,T,44,true,"atm and atr DNA damage response",88,25561503,"MASCOT Score",22.0000000,0.9860000,,,,,3.0600000
KDSPTVSSSTAAVIDVDDPSLDNPDLGPFLLK,ph,S,61,true,"Large-scale phosphorylation discovery",44,23111157,XCorr,6.1290000,,,,,,
SIACYEEGLK,sno,C,205,true,"hot5-4 / wildtype, FAT-switch S-nitrosoproteome",169,37277371,,,,0.3683451,0.0471776,NO,,
SYCENALR,sno,C,372,false,"hot5-4 / wildtype, FAT-switch S-nitrosoproteome",169,37277371,,,,,,,,
SYCENALR,so,C,372,false,"S-sulfenylation site detection using YAP1C",110,32714340,,,,,,,,
NAFESAVTKLR,ac,K,462,true,"Quantitative Acetylproteomics",101,29440448,,,,,,,,
EAGELFEEAR,nt,E,492,true,"Arg/N-end rule seed, prt6 vs. Wt",99,29168982,"MASCOT Score",44.0200000,,-1.1704819,0.0568642,NO,0.025949999690056,-1.5970983
LREEKLGTANPDFEDEK,ac,K,549,true,"Histone deacetylases - apicidin vs control",98a,29061669,"MaxQuant Score",72.6000000,1.0000000,0.1140000,0.5701643,NO,2.099999960592E-7,
LREEKLGTANPDFEDEK,ac,K,549,true,"Histone deacetylases- hda14 vs WT (low light)",98c,29061669,"MaxQuant Score",122.4900000,1.0000000,-0.4420000,0.9885531,NO,6.6000001197608E-7,
EEKLGTANPDFEDEK,ac,K,549,true,"Histone deacetylases substrates - hda14 vs WT",98e,29061669,"MaxQuant Score",62.9000000,1.0000000,0.3030000,0.6180164,NO,0.00018000000272878,
AKSLQNLIDPNARPPK,ph,S,581,true,"atm and atr DNA damage response",88,25561503,"MASCOT Score",35.0000000,1.0000000,,,,,0.8400000
SLQNLIDPNARPPKK,ph,S,581,true,"Tissue atlas Arabidopsis - ProteomicsDB",114,32188942,"MaxQuant score",199.3300000,1.0000000,,,,7.7939801112768E-32,
SLQNLIDPNARPPK,ph,S,581,true,"atm and atr DNA damage response",88,25561503,"MASCOT Score",26.0000000,1.0000000,,,,,0.4400000
SLQNLIDPNARPPK,ph,S,581,true,"TOR Kinase and ABA Receptor",100,29290610,XCorr,3.8030629,1.0000000,,,,5.28900000063E-6,
KWPSLGFKF,ph,S,604,true,"Tissue atlas Arabidopsis - ProteomicsDB",114,32188942,"MaxQuant score",156.5700000,1.0000000,,,,0.00062820297898725,
KWPSLGFK,ph,S,604,true,"atm and atr DNA damage response",88,25561503,"MASCOT Score",27.0000000,1.0000000,,,,,-2.9700000
KWPSLGFK,ph,S,604,true,"TOR Kinase and ABA Receptor",100,29290610,XCorr,2.4677970,1.0000000,,,,0.017909999936819,
