Peptide,PTM,ModifiedAA,ModifiedPosition,PeptideUniqueToGene,ExperimentDesc,ExpID,PubmedID,ScoreType,IdentScore,LocProb,Log2FChange,PQ-val,QuantSig,PEP,MassErrorPPM
METESDDATITVVKDMR,nta,M,1,true,"Arabidopsis translation initiation landscape - NTA",167a,35069635,,,,,,,,
ATITVVK,nta,A,8,false,"Characterization plant N-terminal acetylation",6,22223895,"MASCOT Score",40.3400000,,,,,,
LISSFTNRPFVATPPLPEPK,ph,T,67,true,"Tissue atlas Arabidopsis - ProteomicsDB",114,32188942,"MaxQuant score",108.4400000,0.9992840,,,,6.6524802160017E-12,
SKSMLVDSNQRDAE,nt,S,97,true,"Arabidopsis translation initiation landscape - NT",167b,35069635,,,,,,,,
LGTQLQQLHGHDSK,ph,S,97,true,"atm and atr DNA damage response",88,25561503,"MASCOT Score",25.0000000,1.0000000,,,,,-0.1700000
LGTQLQQLHGHDSK,ph,S,97,true,"Tissue atlas Arabidopsis - ProteomicsDB",114,32188942,"MaxQuant score",99.1100000,1.0000000,,,,4.2662999476306E-5,
DAEADGSSGSPMALVR,ph,S,114,true,"Tissue atlas Arabidopsis - ProteomicsDB",114,32188942,"MaxQuant score",266.4500000,0.9749040,,,,0,
DAEADGSSGSPMALVR,ph,S,117,true,"Tissue atlas Arabidopsis - ProteomicsDB",114,32188942,"MaxQuant score",145.9400000,0.9716220,,,,1.99142993762E-10,
LLKELPESFQGNNESNR,ub,K,214,true,"Arabidopsis ubiquitination COFRADIC",40,26744219,"MaxQuant Score",73.1680000,1.0000000,,,,2.4899999839789E-9,-0.5330000
ASYPEIDVQPPSPPRASAMETDNEPMAIDSITA,ph,S,664,true,"TOR Kinase and ABA Receptor",100,29290610,XCorr,3.1588132,0.8073000,,,,0.0012339999666438,
ASYPEIDVQPPSPPR,ph,S,664,true,"Phosphorylation nuclei-enriched fractions",28,19245862,,,,,,,,
ASYPEIDVQPPSPPR,ph,S,664,true,"STN8 phosphoproteome",38,21768351,"MASCOT Score",60.9900000,,,,,,-1.7916600
ASYPEIDVQPPSPPR,ph,S,664,true,"Large-scale phosphorylation discovery",44,23111157,XCorr,4.0240000,,,,,,
ASYPEIDVQPPSPPR,ph,S,664,true,"Tyrosine phosphorylation in Arabidopsis",59,18463617,"MASCOT Score",62.0000000,,,,,,-0.5196947
ASYPEIDVQPPSPPR,ph,S,664,true,"Chloroplast kinase substrates",60,19376835,"MASCOT Score",34.8800000,,,,,,-0.6150550
ASYPEIDVQPPSPPR,ph,S,664,true,"srk2dei ABA signaling phopshoproteomics",83,23572148,"MASCOT Score",34.0000000,,,,,,0.0003000
ASYPEIDVQPPSPPR,ph,S,664,true,"LAXIC - ABA stress",84a,23660473,XCorr,3.6000000,1.0000000,,,,0.039295200258493,
ASYPEIDVQPPSPPR,ph,S,664,true,"LAXIC - mannitol vs control",84b,23660473,XCorr,3.0600000,1.0000000,,,,0.00046651798766106,
ASYPEIDVQPPSPPR,ph,S,664,true,"SnRK2 protein kinase substrates",85,23776212,XCorr,2.8532720,1.0000000,,,,3.0659098371189E-8,
ASYPEIDVQPPSPPR,ph,S,664,true,"atm and atr DNA damage response",88,25561503,"MASCOT Score",66.0000000,1.0000000,,,,,-0.6700000
ASYPEIDVQPPSPPR,ph,S,664,true,"TOR Kinase and ABA Receptor",100,29290610,XCorr,3.6915715,1.0000000,,,,0.00011870000162162,
ASYPEIDVQPPSPPR,ph,S,664,true,"Lateral root-induction - NAA vs control",106,23328941,"MASCOT Score",42.0000000,,,,,,
ASYPEIDVQPPSPPR,ph,S,664,true,"Phospho cell culture sucrose/TOR",109,30833711,,,1.0000000,,,,,
ASYPEIDVQPPSPPR,ph,S,664,true,"Col-0 callus - FC Col-0 vs. Col-0 Xray",111a,31410901,,52.2800000,,-0.3207567,0.0000000,NO,,0.8255353
ASYPEIDVQPPSPPR,ph,S,664,true,"Col-0 X-ray callus - FC Col-0 vs. Col-0 Xray",111b,31410901,,52.2800000,,-0.3207567,0.0000000,NO,,0.8255353
ASYPEIDVQPPSPPR,ph,S,664,true,"atm callus - FC atm vs. atm Xray",111c,31410901,,52.2800000,,-0.0342725,0.0000000,NO,,0.8255353
ASYPEIDVQPPSPPR,ph,S,664,true,"atm-3 X-ray callus - FC atm vs. atm Xray",111d,31410901,,52.2800000,,-0.0342725,0.0000000,NO,,0.8255353
ASYPEIDVQPPSPPR,ph,S,664,true,"Tissue atlas Arabidopsis - ProteomicsDB",114,32188942,"MaxQuant score",239.5800000,1.0000000,,,,0,
ASYPEIDVQPPSPPR,ph,S,664,true,"Touch-induced phosphorylation: 40s touch vs untouc",136,30291188,"MASCOT score",72.4500000,,0.0255204,0.9506438,NO,,2.3582203
