Peptide,PTM,ModifiedAA,ModifiedPosition,PeptideUniqueToGene,ExperimentDesc,ExpID,PubmedID,ScoreType,IdentScore,LocProb,Log2FChange,PQ-val,QuantSig,PEP,MassErrorPPM
MDSSSNLNPLRE,nta,M,1,true,"Arg/N-end rule seed, prt6 vs. Wt",99,29168982,"MASCOT Score",85.8800000,,,,,3.5440000374365E-6,-2.5592030
MDSSSNLNPLRE,nta,M,1,true,"HUNTER N-terminome: legumain, GluC and trypsin",119,31951383,"MaxQuant score",121.3600000,,,,,,
MDSSSNLNPLR,nta,M,1,true,"Characterization plant N-terminal acetylation",6,22223895,"MASCOT Score",72.0300000,,,,,,
MDSSSNLNPLR,nta,M,1,true,"Arg/N-end rule seed, prt6 vs. Wt",99,29168982,"MASCOT Score",89.3700000,,,,,0.001388999982737,-0.6438796
MDSSSNLNPLR,nta,M,1,true,"HUNTER N-terminome: legumain, GluC and trypsin",119,31951383,"MaxQuant score",144.7700000,,,,,,
MDSSSNLNPLR,ph,S,3,true,"Tissue atlas Arabidopsis - ProteomicsDB",114,32188942,"MaxQuant score",132.5600000,0.9599580,,,,8.7749498334233E-7,
EDTSEEHLEPIEAPASVFAAR,ph,S,27,true,"Tissue atlas Arabidopsis - ProteomicsDB",114,32188942,"MaxQuant score",71.5240000,0.9999990,,,,6.6807901930588E-6,
PLRPPSTNSSEK,ph,S,38,true,"Tissue atlas Arabidopsis - ProteomicsDB",114,32188942,"MaxQuant score",119.9200000,0.9438130,,,,8.5491101344815E-6,
