Peptide,PTM,ModifiedAA,ModifiedPosition,PeptideUniqueToGene,ExperimentDesc,ExpID,PubmedID,ScoreType,IdentScore,LocProb,Log2FChange,PQ-val,QuantSig,PEP,MassErrorPPM
KQEESSLEK,ph,S,9,true,"atm and atr DNA damage response",88,25561503,"MASCOT Score",29.0000000,0.9960000,,,,,-1.2400000
LSTWYQDGEQDGGDRSEK,ph,S,28,true,"Tissue atlas Arabidopsis - ProteomicsDB",114,32188942,"MaxQuant score",52.6570000,0.9999330,,,,0.00063897197833285,
MSLKASDFESSSR,ub,K,36,true,"Arabidopsis ubiquitination COFRADIC",40,26744219,"MaxQuant Score",51.7260000,1.0000000,,,,0.0008133000228554,-0.2180000
SKEDNKSVVDVEHQDR,ph,S,57,true,"Tissue atlas Arabidopsis - ProteomicsDB",114,32188942,"MaxQuant score",101.9400000,0.9999980,,,,1.6570600109844E-6,
VSVSNEHGESR,ph,S,121,true,"atm and atr DNA damage response",88,25561503,"MASCOT Score",25.0000000,0.9080000,,,,,2.0400000
VSVSNEHGESR,ph,S,123,true,"atm and atr DNA damage response",88,25561503,"MASCOT Score",54.0000000,0.9250000,,,,,0.1400000
VSVSNEHGESR,ph,S,123,true,"Tissue atlas Arabidopsis - ProteomicsDB",114,32188942,"MaxQuant score",103.7600000,0.9999750,,,,1.5320800230256E-5,
VSVSNEHGESR,ph,S,129,true,"atm and atr DNA damage response",88,25561503,"MASCOT Score",25.0000000,0.9080000,,,,,2.0400000
DLKSDRSLK,ph,S,138,true,"Tissue atlas Arabidopsis - ProteomicsDB",114,32188942,"MaxQuant score",101.3000000,0.9999060,,,,0.0064758597873151,
GVKDDDRGSPLK,ph,S,160,true,"Phospho cell culture sucrose/TOR",109,30833711,,,1.0000000,,,,,
GVKDDDRGSPLK,ph,S,160,true,"Tissue atlas Arabidopsis - ProteomicsDB",114,32188942,"MaxQuant score",80.9050000,1.0000000,,,,0.00082824798300862,
SKTPDADYEK,ph,S,183,true,"atm and atr DNA damage response",88,25561503,"MASCOT Score",51.0000000,1.0000000,,,,,-1.5800000
SKTPDADYEK,ph,S,183,true,"Tissue atlas Arabidopsis - ProteomicsDB",114,32188942,"MaxQuant score",129.5400000,1.0000000,,,,0.0010121200466529,
SKTPDADYEKEK,ph,T,185,true,"SnRK2 protein kinase substrates",85,23776212,XCorr,3.2510581,0.9240000,,,,0.00017486099386588,
SKTPDADYEKEK,ph,T,185,true,"Protein sumoylation and phosphorylation cross-talk",97,28419593,,,,,,,,
SKTPDADYEKEK,ph,T,185,true,"Phospho cell culture sucrose/TOR",109,30833711,,,0.9999240,,,,,
SKTPDADYEK,ph,T,185,true,"LAXIC - mannitol vs control",84b,23660473,XCorr,2.1300000,0.9790000,,,,0.16090199351311,
SKTPDADYEK,ph,T,185,true,"SnRK2 protein kinase substrates",85,23776212,XCorr,2.6013827,0.9950000,,,,0.0019550800789148,
SKTPDADYEK,ph,T,185,true,"atm and atr DNA damage response",88,25561503,"MASCOT Score",51.0000000,1.0000000,,,,,-1.5800000
SKTPDADYEK,ph,T,185,true,"TOR Kinase and ABA Receptor",100,29290610,XCorr,3.1755815,0.8942000,,,,0.0069840000942349,
SKTPDADYEK,ph,T,185,true,"Tissue atlas Arabidopsis - ProteomicsDB",114,32188942,"MaxQuant score",206.4900000,1.0000000,,,,1.2595400076654E-28,
ALSSGGVSNENYDVIEIQTKPHDYVR,ph,S,283,true,"Tissue atlas Arabidopsis - ProteomicsDB",114,32188942,"MaxQuant score",204.3500000,0.9990990,,,,0,
MTESGQQPPKKPSNNEEEWAHNQEGR,ph,S,319,true,"Tissue atlas Arabidopsis - ProteomicsDB",114,32188942,"MaxQuant score",73.7970000,0.9985870,,,,2.4820098754041E-10,
TNFVQTPNR,ph,T,388,true,"Tissue atlas Arabidopsis - ProteomicsDB",114,32188942,"MaxQuant score",107.5100000,1.0000000,,,,0.001614150009118,
TSGGWVPPRGGGPPGK,me1,R,553,true,"Arabidopsis protein methylome",123,31809900,"MaxQuant Score",74.7890000,1.0000000,,,,1.8010199998031E-9,0.2914700
NPPPDAPHLVVTTPDIESLRPKSPMK,ph,S,863,true,"Tissue atlas Arabidopsis - ProteomicsDB",114,32188942,"MaxQuant score",130.2500000,0.9105840,,,,1.1544000243407E-35,
NPPPDAPHLVVTTPDIESLRPKSPMK,ph,S,868,true,"PAMP-triggered phosphorylation",48,24601666,"MASCOT Score",37.1900000,,,,,,
NPPPDAPHLVVTTPDIESLRPKSPMK,ph,S,868,true,"Phospho cell culture sucrose/TOR",109,30833711,,,0.9857400,,,,,
SPMKNQQQQSYPSSLASANSSNR,ph,S,868,true,"Tissue atlas Arabidopsis - ProteomicsDB",114,32188942,"MaxQuant score",306.4000000,1.0000000,,,,0,
NQQQQSYPSSLASANSSNR,ph,S,877,true,"Tissue atlas Arabidopsis - ProteomicsDB",114,32188942,"MaxQuant score",83.2290000,0.9943930,,,,3.6148900107946E-5,
