Peptide,PTM,ModifiedAA,ModifiedPosition,PeptideUniqueToGene,ExperimentDesc,ExpID,PubmedID,ScoreType,IdentScore,LocProb,Log2FChange,PQ-val,QuantSig,PEP,MassErrorPPM
MEKPNPRRPS,nta,M,1,true,"N-term acetylation drought responses",5,26184543,,,,,,,,
MEKPNPR,nta,M,1,true,"Arg/N-end rule pathway Roots",80,25728785,"MASCOT Score",29.4900000,,,,,0.12179999798536,
MEKPNPR,nta,M,1,true,"Arabidopsis translation initiation landscape - NTA",167a,35069635,,,,,,,,
RPSNSVLPYETPR,ph,S,10,true,"atm and atr DNA damage response",88,25561503,"MASCOT Score",36.0000000,0.9960000,,,,,0.2300000
RPSNSVLPYETPR,ph,S,10,true,"Tissue atlas Arabidopsis - ProteomicsDB",114,32188942,"MaxQuant score",164.5300000,0.9999280,,,,7.5017603240468E-11,
SSSANYACK,so,C,53,true,"Arabidopsis S-sulfenylation chemoproteomics",108,31578252,"pFind PSM Score",0.0407569,,1.1111100,,,,-1.9369282
LVCREDYEDVWR,so,C,63,false,"S-sulfenylation site detection using YAP1C",110,32714340,,,,,,,,
GCFSER,sno,C,120,true,"hot5-4 / wildtype, FAT-switch S-nitrosoproteome",169,37277371,,,,,,,,
TILGVVEACHSLGVMHR,so,C,140,false,"Arabidopsis S-sulfenylation chemoproteomics",108,31578252,"pFind PSM Score",0.1612130,,2.7777800,,,,-1.3315195
TESGIFR,ph,S,231,false,"Arabidopsis root NAA phosphoproteome",18a,27643528,"MaxQuant Score",53.9680000,0.9990000,,,,0.0080000003799796,-0.8510000
TESGIFR,ph,S,231,false,"Phosphorylation Early Elicitor Signaling",23,17317660,,,,,,,,
TESGIFR,ph,S,231,false,"Plasmembrane Ph Immune Responses",25,17651370,,,,,,,,
TESGIFR,ph,S,231,false,"srk2dei ABA signaling phopshoproteomics",83,23572148,"MASCOT Score",47.0000000,,,,,,-0.0001000
TESGIFR,ph,S,231,false,"Phospho cell culture sucrose/TOR",109,30833711,,,0.9999660,,,,,
TESGIFR,ph,S,231,false,"Tissue atlas Arabidopsis - ProteomicsDB",114,32188942,"MaxQuant score",194.2900000,1.0000000,,,,6.5661898140945E-9,
RVGSELMESEIK,ph,S,360,false,"atm and atr DNA damage response",88,25561503,"MASCOT Score",38.0000000,1.0000000,,,,,-1.6500000
VGSELMESEIK,ph,S,360,false,"Phospho cell culture sucrose/TOR",109,30833711,,,0.9994730,,,,,
VGSELMESEIK,ph,S,360,false,"Tissue atlas Arabidopsis - ProteomicsDB",114,32188942,"MaxQuant score",228.9300000,1.0000000,,,,5.4552549216165E-42,
