Peptide,PTM,ModifiedAA,ModifiedPosition,PeptideUniqueToGene,ExperimentDesc,ExpID,PubmedID,ScoreType,IdentScore,LocProb,Log2FChange,PQ-val,QuantSig,PEP,MassErrorPPM
GGVSFLSTVP,nt,G,2,true,"N-term acetylation drought responses",5,26184543,,,,,,,,
AKPELVPSLLK,ac,K,118,true,"Quantitative Acetylproteomics",101,29440448,,,,,,,,
LALNDAMTYDK,mox,M,125,true,"cat2 Methionine oxidation - 1h stress",62a,25693801,"MASCOT Score",90.0000000,,0.1071307,,NO,,
LALNDAMTYDK,mox,M,125,true,"cat2 Methionine oxidation - 3h stress",62b,25693801,"MASCOT Score",90.0000000,,0.1802761,,NO,,
ATKSGGANGSIR,ac,K,132,true,"Quantitative Acetylproteomics",101,29440448,,,,,,,,
AENEGLSDGLSLIEEVKK,ph,S,155,true,"Tissue atlas Arabidopsis - ProteomicsDB",114,32188942,"MaxQuant score",99.0780000,0.9941080,,,,4.3491201040524E-7,
AENEGLSDGLSLIEEVKK,ph,S,159,true,"Tissue atlas Arabidopsis - ProteomicsDB",114,32188942,"MaxQuant score",111.8800000,0.9999050,,,,2.8302599153207E-10,
ATVQEMKDK,mox,M,255,true,"cat2 Methionine oxidation - 1h stress",62a,25693801,"MASCOT Score",44.0000000,,-0.3428294,,NO,,
ATVQEMKDK,mox,M,255,true,"cat2 Methionine oxidation - 3h stress",62b,25693801,"MASCOT Score",48.0000000,,-0.3940603,,NO,,
ATVQEMK,mox,M,255,true,"cat2 Methionine oxidation - 3h stress",62b,25693801,"MASCOT Score",37.0000000,,0.2685308,,NO,,
ATVQEMKDK,ac,K,256,true,"Quantitative Acetylproteomics",101,29440448,,,,,,,,
DKFIAVGLGPR,ac,K,258,true,"Histone deacetylases - hda14 vs WT (thylakoids)",98d,29061669,"MaxQuant Score",74.0000000,1.0000000,0.5700000,0.8394600,NO,0.003000000026077,
DKFIAVGLGPR,ac,K,258,true,"Quantitative Acetylproteomics",101,29440448,,,,,,,,
QLLATDPQVAPWVQKYQRSRE,nt,Q,285,true,"HUNTER N-terminome: legumain, GluC and trypsin",119,31951383,"MaxQuant score",67.9950000,,,,,,
TVSQTDYE,nt,T,306,true,"N-terminal ChaFRADIC",92,26010716,"MASCOT Score",27.5100000,,,,,0.02170000039041,
