Peptide,PTM,ModifiedAA,ModifiedPosition,PeptideUniqueToGene,ExperimentDesc,ExpID,PubmedID,ScoreType,IdentScore,LocProb,Log2FChange,PQ-val,QuantSig,PEP,MassErrorPPM
SGSVSGCGSGGCSIVWFR,nta,S,2,true,"HUNTER N-terminome: legumain, GluC and trypsin",119,31951383,"MaxQuant score",155.6600000,,,,,,
SVLQAAGIE,nt,S,457,true,"N-terminal ChaFRADIC",92,26010716,"MASCOT Score",55.0200000,,,,,0.00033889999031089,
AAIENGSEEGLGDSAEVEEAPIEFPR,ph,S,506,true,"STN8 phosphoproteome",38,21768351,"MASCOT Score",57.9100000,,,,,,-1.5048400
AAIENGSEEGLGDSAEVEEAPIEFPR,ph,S,506,true,"srk2dei ABA signaling phopshoproteomics",83,23572148,"MASCOT Score",25.0000000,,,,,,-0.0004000
AAIENGSEEGLGDSAEVEEAPIEFPR,ph,S,506,true,"LAXIC - ABA stress",84a,23660473,XCorr,7.1000000,0.9530000,,,,5.1200000598328E-5,
AAIENGSEEGLGDSAEVEEAPIEFPR,ph,S,506,true,"LAXIC - mannitol vs control",84b,23660473,XCorr,5.8900000,0.9970000,,,,0.0017108500469476,
AAIENGSEEGLGDSAEVEEAPIEFPR,ph,S,506,true,"SnRK2 protein kinase substrates",85,23776212,XCorr,5.5312991,1.0000000,,,,1.6384600343144E-9,
AAIENGSEEGLGDSAEVEEAPIEFPR,ph,S,513,true,"TOR Kinase and ABA Receptor",100,29290610,XCorr,5.4763207,0.8688000,,,,2.5910001113516E-6,
IVAESTEDSTAESSSSGRR,ph,S,625,true,"atm and atr DNA damage response",88,25561503,"MASCOT Score",76.0000000,0.8010000,,,,,-1.8600000
