Peptide,PTM,ModifiedAA,ModifiedPosition,PeptideUniqueToGene,ExperimentDesc,ExpID,PubmedID,ScoreType,IdentScore,LocProb,Log2FChange,PQ-val,QuantSig,PEP,MassErrorPPM
FTSVSASSIEKGQNRVI,nt,F,21,true,"Arabidopsis translation initiation landscape - NT",167b,35069635,,,,,,,,
FTSVSASSIEKGQNR,nt,F,21,true,"Mitochondrial intermediate peptidases - icp55 / WT",131a,25732537,,88.5500000,,2.2593995,,,,
FTSVSASSIEKGQNR,nt,F,21,true,"Mitochondrial intermediate peptidases - oct1-1 / WT",131b,25732537,,99.6000000,,-0.2703112,,,,
FTSVSASSIEKGQNR,nt,F,21,true,"Mitochondrial intermediate peptidases - oct1-2 / WT",131c,25732537,,99.8200000,,-0.4467451,,,,
FTSVSASSIE,nt,F,21,true,"N-terminal ChaFRADIC",92,26010716,"MASCOT Score",30.0200000,,,,,0.0050730002112687,
FTSVSASSIE,nt,F,21,true,"Arg/N-end rule seed, prt6 vs. Wt",99,29168982,"MASCOT Score",47.1000000,,-0.0432237,0.7990627,NO,0.00014069999451749,-1.4978361
TSVSASSIEKGQNRVIDASLTL,nt,T,22,true,"Arabidopsis translation initiation landscape - NT",167b,35069635,,,,,,,,
TSVSASSIEKGQNR,nt,T,22,true,"Mitochondrial intermediate peptidases - icp55 / WT",131a,25732537,,98.9700000,,-2.6697176,,,,
TSVSASSIEKGQNR,nt,T,22,true,"Mitochondrial intermediate peptidases - oct1-1 / WT",131b,25732537,,90.7600000,,-0.3482655,,,,
TSVSASSIEKGQNR,nt,T,22,true,"Mitochondrial intermediate peptidases - oct1-2 / WT",131c,25732537,,100.8900000,,0.5572523,,,,
TSVSASSIE,nt,T,22,true,"N-terminal ChaFRADIC",92,26010716,"MASCOT Score",32.4100000,,,,,0.028550000861287,
TSVSASSIE,nt,T,22,true,"Arg/N-end rule seed, prt6 vs. Wt",99,29168982,"MASCOT Score",73.3000000,,-0.3110837,0.3075267,NO,0.00086560001363978,2.3187748
TSVSASSIEKGQNR,nta,T,22,true,"Mitochondrial intermediate peptidases - oct1-1 / WT",131b,25732537,,61.0200000,,0.3290737,,,,
TSVSASSIEKGQNR,nta,T,22,true,"Mitochondrial intermediate peptidases - oct1-2 / WT",131c,25732537,,71.0100000,,1.1067737,,,,
SVSASSIEKGQNR,nt,S,23,true,"Mitochondrial intermediate peptidases - icp55 / WT",131a,25732537,,94.6400000,,-6.3412123,,,,
SVSASSIEKGQNR,nt,S,23,true,"Mitochondrial intermediate peptidases - oct1-1 / WT",131b,25732537,,92.6500000,,,,,,
SVSASSIEKGQNR,nt,S,23,true,"Mitochondrial intermediate peptidases - oct1-2 / WT",131c,25732537,,94.5600000,,-6.6438562,,,,
EAIWCGSTNSATEEGK,sno,C,95,true,"Site-specific nitrosomeproteomic id - gsnor1-3",90a,25699590,XCorr,2.2437742,,,,,0.00041000000783242,-6.7766469
EAIWCGSTNSATEEGK,sno,C,95,true,"Site-specific nitrosomeproteomic id - gsnor1-3",90b,25699590,XCorr,3.5200000,,,,,0.00013729999773204,-6.4300000
