Peptide,PTM,ModifiedAA,ModifiedPosition,PeptideUniqueToGene,ExperimentDesc,ExpID,PubmedID,ScoreType,IdentScore,LocProb,Log2FChange,PQ-val,QuantSig,PEP,MassErrorPPM
LHFHDCFVNGCDASILLDNTTSFR,ng,N,79,false,"Conserved N-glycosylation",74,22633491,"MaxQuant Score",229.1500000,1.0000000,,,,0,-0.6070000
LHFHDCFVNGCDASILLDNTTSFR,ng,N,79,false,"Open search Plant PTM Viewer 2.0 - N-glycosylation",164a,TBA,,,,,,,,
TEKDAFGNANSAR,ac,K,87,false,"Quantitative Acetylproteomics",101,29440448,,,,,,,,
TEKDAFGNANSAR,ub,K,87,false,"Arabidopsis ubiquitination COFRADIC",40,26744219,"MaxQuant Score",237.2100000,1.0000000,,,,0,0.2030000
NQCQFIMDR,ox,C,199,false,"OxiTRAQ Arabidopsis - 5 mM H2O2 versus control",47,24376095,,,,0.0164417,0.8961124,NO,,
NQCQFIMDR,sno,C,199,false,"hot5-4 / wildtype, FAT-switch S-nitrosoproteome",169,37277371,,,,,,,,
LYNFSNTGLPDPTLDK,ng,N,208,true,"Conserved N-glycosylation",74,22633491,"MaxQuant Score",84.5790000,0.9240000,,,,3.8199999835342E-5,1.1570000
LYNFSNTGLPDPTLDK,ng,N,208,true,"UDP-GlcNAc transporter glycopeptide analysis",135,30224661,,,,,,,4.2148167549472E-17,0.8000000
NGNQSVLVDFDLR,ng,N,236,false,"N-linked Glycan Micro-heterogeneity Arabidopsis",134,29237727,,,,,,,,
NGNQSVLVDFDLR,ng,N,236,false,"UDP-GlcNAc transporter glycopeptide analysis",135,30224661,,,,,,,5.0228010862864E-16,0.2000000
MSSLSPLTGKQGEIR,ub,K,315,false,"Arabidopsis ubiquitination COFRADIC",40,26744219,"MaxQuant Score",89.9110000,1.0000000,,,,6.4419998224707E-9,0.7630000
