Peptide,PTM,ModifiedAA,ModifiedPosition,PeptideUniqueToGene,ExperimentDesc,ExpID,PubmedID,ScoreType,IdentScore,LocProb,Log2FChange,PQ-val,QuantSig,PEP,MassErrorPPM
MKKSTGR,nta,M,8,true,"Arabidopsis translation initiation landscape - NTA",167a,35069635,,,,,,,,
SLEFPEPTSFR,ph,S,62,true,"Tyrosine phosphorylation in Arabidopsis",59,18463617,"MASCOT Score",38.0000000,,,,,,-0.5041046
SLEFPEPTSFR,ph,S,62,true,"srk2dei ABA signaling phopshoproteomics",83,23572148,"MASCOT Score",35.0000000,,,,,,0.0015000
SLEFPEPTSFR,ph,S,62,true,"atm and atr DNA damage response",88,25561503,"MASCOT Score",33.0000000,1.0000000,,,,,-0.1600000
SLEFPEPTSFR,ph,S,62,true,"Phospho cell culture sucrose/TOR",109,30833711,,,0.9999950,,,,,
SLEFPEPTSFR,ph,S,62,true,"Tissue atlas Arabidopsis - ProteomicsDB",114,32188942,"MaxQuant score",123.6700000,1.0000000,,,,1.6972500816337E-5,
SLEFPEPTSFR,ph,T,69,true,"atm and atr DNA damage response",88,25561503,"MASCOT Score",26.0000000,0.9380000,,,,,0.0600000
SLEFPEPTSFR,ph,T,69,true,"Tissue atlas Arabidopsis - ProteomicsDB",114,32188942,"MaxQuant score",171.3200000,0.8885530,,,,3.2808901428982E-11,
SLEFPEPTSFR,ph,S,70,true,"Large-scale phosphorylation discovery",44,23111157,XCorr,3.3310000,,,,,,
SLEFPEPTSFR,ph,S,70,true,"atm and atr DNA damage response",88,25561503,"MASCOT Score",43.0000000,1.0000000,,,,,1.0300000
SSSDVVNR,ph,S,111,true,"atm and atr DNA damage response",88,25561503,"MASCOT Score",57.0000000,0.9690000,,,,,0.1100000
FKSFDLDKVR,ph,S,119,true,"Phospho cell culture sucrose/TOR",109,30833711,,,1.0000000,,,,,
FKSFDLDK,ph,S,119,true,"atm and atr DNA damage response",88,25561503,"MASCOT Score",29.0000000,1.0000000,,,,,-2.1700000
SFDLDKVR,ph,S,119,true,"Tissue atlas Arabidopsis - ProteomicsDB",114,32188942,"MaxQuant score",134.3000000,1.0000000,,,,0.00015011099458206,
DQDLSEEGPSGVVVGSDSMNHK,ph,S,142,true,"Tissue atlas Arabidopsis - ProteomicsDB",114,32188942,"MaxQuant score",104.6000000,0.8866970,,,,1.4785600044656E-12,
DQDLSEEGPSGVVVGSDSMNHK,ph,S,144,true,"Tissue atlas Arabidopsis - ProteomicsDB",114,32188942,"MaxQuant score",173.9200000,0.7505640,,,,2.8025969286496E-45,
RPLPSVGSGGSGSASPLLR,ph,S,596,true,"Tissue atlas Arabidopsis - ProteomicsDB",114,32188942,"MaxQuant score",98.2100000,0.9807450,,,,1.1795099652545E-7,
RPLPSVGSGGSGSASPLLR,ph,S,603,true,"Tissue atlas Arabidopsis - ProteomicsDB",114,32188942,"MaxQuant score",159.4600000,0.9995040,,,,7.0479300829357E-23,
