Peptide,PTM,ModifiedAA,ModifiedPosition,PeptideUniqueToGene,ExperimentDesc,ExpID,PubmedID,ScoreType,IdentScore,LocProb,Log2FChange,PQ-val,QuantSig,PEP,MassErrorPPM
SDGDSTTTSAMEISGDKIDLK,ph,S,2,true,"Tissue atlas Arabidopsis - ProteomicsDB",114,32188942,"MaxQuant score",339.4600000,0.9998550,,,,0,
SDGDSTTTSAMEISGDK,ph,S,2,true,"atm and atr DNA damage response",88,25561503,"MASCOT Score",88.0000000,0.9950000,,,,,-0.3000000
SDGDSTTTSAMEISGDK,ph,S,2,true,"Phospho cell culture sucrose/TOR",109,30833711,,,0.9999470,,,,,
SDGDSTTTSAMEISGDK,ph,S,6,true,"atm and atr DNA damage response",88,25561503,"MASCOT Score",32.0000000,0.8840000,,,,,1.2100000
SDGDSTTTSAMEISGDKIDLK,ph,T,7,true,"Tissue atlas Arabidopsis - ProteomicsDB",114,32188942,"MaxQuant score",168.7900000,0.8017350,,,,2.887909952186E-36,
SDGDSTTTSAMEISGDKIDLK,ph,S,10,true,"Tissue atlas Arabidopsis - ProteomicsDB",114,32188942,"MaxQuant score",322.9400000,0.9940190,,,,0,
SDGDSTTTSAMEISGDKIDLK,ph,S,15,true,"Tissue atlas Arabidopsis - ProteomicsDB",114,32188942,"MaxQuant score",264.5200000,0.9999990,,,,0,
DGEATTPPKTDIESQILAAMQSR,ph,T,27,true,"SnRK2 protein kinase substrates",85,23776212,XCorr,3.7830420,0.8980000,,,,0.00094101001741365,
DGEATTPPKTDIESQILAAMQSR,ph,T,28,true,"Phospho cell culture sucrose/TOR",109,30833711,,,0.8807070,,,,,
DGEATTPPKTDIESQILAAMQSR,ph,T,28,true,"Col-0 callus - FC Col-0 vs. Col-0 Xray",111a,31410901,,33.9200000,,-2.6767582,0.0000000,NO,,0.5788923
DGEATTPPKTDIESQILAAMQSR,ph,T,28,true,"Col-0 X-ray callus - FC Col-0 vs. Col-0 Xray",111b,31410901,,33.9200000,,-2.6767582,0.0000000,NO,,0.5788923
DGEATTPPKTDIESQILAAMQSR,ph,T,28,true,"atm callus - FC atm vs. atm Xray",111c,31410901,,33.9200000,,-0.3735241,0.0000000,NO,,0.5788923
DGEATTPPKTDIESQILAAMQSR,ph,T,28,true,"atm-3 X-ray callus - FC atm vs. atm Xray",111d,31410901,,33.9200000,,-0.3735241,0.0000000,NO,,0.5788923
DGEATTPPKTDIESQILAAMQSR,ph,T,28,true,"Tissue atlas Arabidopsis - ProteomicsDB",114,32188942,"MaxQuant score",172.3200000,0.9914460,,,,0,
DGEATTPPKTDIESQILAAMQSR,ph,T,32,true,"Col-0 callus - FC Col-0 vs. Col-0 Xray",111a,31410901,,59.5000000,,0.0949143,0.0000000,NO,,0.7050854
DGEATTPPKTDIESQILAAMQSR,ph,T,32,true,"Col-0 X-ray callus - FC Col-0 vs. Col-0 Xray",111b,31410901,,59.5000000,,0.0949143,0.0000000,NO,,0.7050854
DGEATTPPKTDIESQILAAMQSR,ph,T,32,true,"atm callus - FC atm vs. atm Xray",111c,31410901,,59.5000000,,-1.5012250,0.0000000,NO,,0.7050854
DGEATTPPKTDIESQILAAMQSR,ph,T,32,true,"atm-3 X-ray callus - FC atm vs. atm Xray",111d,31410901,,59.5000000,,-1.5012250,0.0000000,NO,,0.7050854
DGEATTPPKTDIESQILAAMQSR,ph,S,36,true,"srk2dei ABA signaling phopshoproteomics",83,23572148,"MASCOT Score",72.0000000,,,,,,-0.0002000
DKADNFTFEGVR,ub,K,52,true,"Arabidopsis ubiquitination COFRADIC",40,26744219,"MaxQuant Score",61.2350000,1.0000000,,,,0.00019910000264645,-0.1910000
HALDVHKSFVK,ph,S,81,true,"Tissue atlas Arabidopsis - ProteomicsDB",114,32188942,"MaxQuant score",105.1700000,1.0000000,,,,0.00066853902535513,
QHLVQCLAGAENDETSENSLETEK,so,C,90,true,"S-sulfenylation site detection using YAP1C",110,32714340,,,,,,,,
QHLVQCLAGAENDETSENSLETEKK,ph,T,99,true,"Tissue atlas Arabidopsis - ProteomicsDB",114,32188942,"MaxQuant score",235.9400000,0.7885950,,,,0,
QHLVQCLAGAENDETSENSLETEKKDDVTPVK,ph,S,100,true,"Brassinosteroid-Regulated Phosphorylation Dynamics",94,26187819,"MaxQuant Score",55.1530000,0.7660000,,,,0.017000000923872,1.7800000
QHLVQCLAGAENDETSENSLETEKKDDVTPVK,ph,S,100,true,"Tissue atlas Arabidopsis - ProteomicsDB",114,32188942,"MaxQuant score",345.3000000,0.9963290,,,,0,
QHLVQCLAGAENDETSENSLETEK,ph,S,100,true,"srk2dei ABA signaling phopshoproteomics",83,23572148,"MASCOT Score",50.0000000,,,,,,-0.0022000
QHLVQCLAGAENDETSENSLETEK,ph,S,100,true,"LAXIC - mannitol vs control",84b,23660473,XCorr,4.5900000,0.8760000,,,,7.0300001930867E-11,
QHLVQCLAGAENDETSENSLETEK,ph,S,100,true,"Brassinosteroid-Regulated Phosphorylation Dynamics",94,26187819,"MaxQuant Score",126.0200000,0.9940000,,,,2.1960000007662E-13,-1.6480000
QHLVQCLAGAENDETSENSLETEK,ph,S,100,true,"TOR Kinase and ABA Receptor",100,29290610,XCorr,4.7565145,0.9625000,,,,0.0059259999543428,
QHLVQCLAGAENDETSENSLETEK,ph,S,100,true,"Phospho cell culture sucrose/TOR",109,30833711,,,0.9798430,,,,,
QHLVQCLAGAENDETSENSLETEK,ph,S,100,true,"Col-0 callus - FC Col-0 vs. Col-0 Xray",111a,31410901,,29.0100000,,1.0328606,0.0000000,NO,,0.7652429
QHLVQCLAGAENDETSENSLETEK,ph,S,100,true,"Col-0 X-ray callus - FC Col-0 vs. Col-0 Xray",111b,31410901,,29.0100000,,1.0328606,0.0000000,NO,,0.7652429
QHLVQCLAGAENDETSENSLETEK,ph,S,100,true,"atm callus - FC atm vs. atm Xray",111c,31410901,,29.0100000,,0.3319238,0.0000000,NO,,0.7652429
QHLVQCLAGAENDETSENSLETEK,ph,S,100,true,"atm-3 X-ray callus - FC atm vs. atm Xray",111d,31410901,,29.0100000,,0.3319238,0.0000000,NO,,0.7652429
QHLVQCLAGAENDETSENSLETEKKDDVTPVK,ph,S,103,true,"Tissue atlas Arabidopsis - ProteomicsDB",114,32188942,"MaxQuant score",345.3000000,0.9977630,,,,0,
QHLVQCLAGAENDETSENSLETEK,ph,S,103,true,"srk2dei ABA signaling phopshoproteomics",83,23572148,"MASCOT Score",42.0000000,,,,,,0.0004000
QHLVQCLAGAENDETSENSLETEK,ph,S,103,true,"LAXIC - mannitol vs control",84b,23660473,XCorr,4.5900000,0.8760000,,,,7.0300001930867E-11,
QHLVQCLAGAENDETSENSLETEK,ph,S,103,true,"Brassinosteroid-Regulated Phosphorylation Dynamics",94,26187819,"MaxQuant Score",126.0200000,0.9980000,,,,2.1960000007662E-13,-1.6480000
QHLVQCLAGAENDETSENSLETEK,ph,S,103,true,"TOR Kinase and ABA Receptor",100,29290610,XCorr,4.7565145,0.8306000,,,,0.0059259999543428,
QHLVQCLAGAENDETSENSLETEK,ph,S,103,true,"Phospho cell culture sucrose/TOR",109,30833711,,,0.9984350,,,,,
QHLVQCLAGAENDETSENSLETEK,ph,S,103,true,"Col-0 callus - FC Col-0 vs. Col-0 Xray",111a,31410901,,29.0100000,,1.0328606,0.0000000,NO,,0.7652429
QHLVQCLAGAENDETSENSLETEK,ph,S,103,true,"Col-0 X-ray callus - FC Col-0 vs. Col-0 Xray",111b,31410901,,29.0100000,,1.0328606,0.0000000,NO,,0.7652429
QHLVQCLAGAENDETSENSLETEK,ph,S,103,true,"atm callus - FC atm vs. atm Xray",111c,31410901,,29.0100000,,0.3319238,0.0000000,NO,,0.7652429
QHLVQCLAGAENDETSENSLETEK,ph,S,103,true,"atm-3 X-ray callus - FC atm vs. atm Xray",111d,31410901,,29.0100000,,0.3319238,0.0000000,NO,,0.7652429
QHLVQCLAGAENDETSENSLETEKKDDVTPVK,ph,T,106,true,"Tissue atlas Arabidopsis - ProteomicsDB",114,32188942,"MaxQuant score",246.9000000,0.8873320,,,,0,
KDDVTPVKEAAELSK,ph,T,113,true,"Tissue atlas Arabidopsis - ProteomicsDB",114,32188942,"MaxQuant score",220.4300000,1.0000000,,,,0,
EAAELSKEHTTK,ph,S,122,true,"Tissue atlas Arabidopsis - ProteomicsDB",114,32188942,"MaxQuant score",58.8240000,0.9950930,,,,0.0036828001029789,
TKDSPVMGLLTEENTSK,ph,T,142,true,"Phosphoproteome iron-deficient Arabidopsis roots",41,22438062,"MASCOT Score",53.0100000,,,,,,
TKDSPVMGLLTEENTSK,ph,T,142,true,"Tyrosine phosphorylation in Arabidopsis",59,18463617,"MASCOT Score",55.0000000,,,,,,-0.8813411
TKDSPVMGLLTEENTSK,ph,T,142,true,"srk2dei ABA signaling phopshoproteomics",83,23572148,"MASCOT Score",52.0000000,,,,,,0.0002000
TKDSPVMGLLTEENTSK,ph,T,142,true,"Tissue atlas Arabidopsis - ProteomicsDB",114,32188942,"MaxQuant score",129.5900000,0.7949150,,,,5.417309911597E-35,
TKDSPVMGLLTEENTSK,ph,S,145,true,"Phosphorylation nuclei-enriched fractions",28,19245862,,,,,,,,
TKDSPVMGLLTEENTSK,ph,S,145,true,"STN8 phosphoproteome",38,21768351,"MASCOT Score",48.8400000,,,,,,
TKDSPVMGLLTEENTSK,ph,S,145,true,"Phosphoproteome iron-deficient Arabidopsis roots",41,22438062,"MASCOT Score",82.1900000,,,,,,
TKDSPVMGLLTEENTSK,ph,S,145,true,"Large-scale phosphorylation discovery",44,23111157,XCorr,4.4230000,,,,,,
TKDSPVMGLLTEENTSK,ph,S,145,true,"PAMP-triggered phosphorylation",48,24601666,"MASCOT Score",25.7100000,,,,,,
TKDSPVMGLLTEENTSK,ph,S,145,true,"Tyrosine phosphorylation in Arabidopsis",59,18463617,"MASCOT Score",74.0000000,,,,,,-0.9331849
TKDSPVMGLLTEENTSK,ph,S,145,true,"Conserved plant phosphoproteome - Arabidopsis",61a,20466843,"MASCOT Score",28.0000000,1.0000000,,,,,
TKDSPVMGLLTEENTSK,ph,S,145,true,"srk2dei ABA signaling phopshoproteomics",83,23572148,"MASCOT Score",92.0000000,,,,,,-0.0009000
TKDSPVMGLLTEENTSK,ph,S,145,true,"LAXIC - mannitol vs control",84b,23660473,XCorr,3.7400000,0.9850000,-1.3485073,,NO,1.110000003024E-8,
TKDSPVMGLLTEENTSK,ph,S,145,true,"SnRK2 protein kinase substrates",85,23776212,XCorr,3.6602840,1.0000000,,,,1.4877000467095E-6,
TKDSPVMGLLTEENTSK,ph,S,145,true,"atm and atr DNA damage response",88,25561503,"MASCOT Score",72.0000000,1.0000000,,,,,-0.2600000
TKDSPVMGLLTEENTSK,ph,S,145,true,"TOR Kinase and ABA Receptor",100,29290610,XCorr,5.5732355,0.9991000,,,,3.969000061943E-8,
TKDSPVMGLLTEENTSK,ph,S,145,true,"Col-0 callus - FC Col-0 vs. Col-0 Xray",111a,31410901,,88.1000000,,0.6029450,0.0000000,NO,,1.3029017
TKDSPVMGLLTEENTSK,ph,S,145,true,"Col-0 X-ray callus - FC Col-0 vs. Col-0 Xray",111b,31410901,,88.1000000,,0.6029450,0.0000000,NO,,1.3029017
TKDSPVMGLLTEENTSK,ph,S,145,true,"atm callus - FC atm vs. atm Xray",111c,31410901,,88.1000000,,1.8006388,0.0000000,NO,,1.3029017
TKDSPVMGLLTEENTSK,ph,S,145,true,"atm-3 X-ray callus - FC atm vs. atm Xray",111d,31410901,,88.1000000,,1.8006388,0.0000000,NO,,1.3029017
TKDSPVMGLLTEENTSK,ph,S,145,true,"Tissue atlas Arabidopsis - ProteomicsDB",114,32188942,"MaxQuant score",361.3100000,1.0000000,,,,0,
DSPVMGLLTEENTSK,ph,S,145,true,"TOR Kinase and ABA Receptor",100,29290610,XCorr,4.1990275,1.0000000,,,,5.6469998526154E-6,
DSPVMGLLTEENTSK,ph,S,145,true,"Phospho cell culture sucrose/TOR",109,30833711,,,1.0000000,,,,,
SVAEQTKDEDKEVLQSDIKKALR,nt,S,159,true,"Metacaspase9 substrates - in vitro rMC9",51c,23964026,"MASCOT Score",85.0000000,,,,,,-0.9397221
DEDKEVLQSDIKK,ph,S,174,true,"Phospho cell culture sucrose/TOR",109,30833711,,,1.0000000,,,,,
EVLQSDIKK,ph,S,174,true,"Tissue atlas Arabidopsis - ProteomicsDB",114,32188942,"MaxQuant score",181.9400000,1.0000000,,,,2.5834000626122E-22,
STPAKNSDSEEMFDSDGEDEEEDKEVAVK,ph,S,252,true,"Conserved plant phosphoproteome - Arabidopsis",61a,20466843,"MASCOT Score",40.0000000,1.0000000,,,,,
STPAKNSDSEEMFDSDGEDEEEDK,ph,S,252,true,"Conserved plant phosphoproteome - Arabidopsis",61a,20466843,"MASCOT Score",37.0000000,1.0000000,,,,,
STPAKNSDSEEMFDSDGEDEEEDKEVAVK,ph,S,258,true,"SnRK2 protein kinase substrates",85,23776212,XCorr,4.3539481,0.9740000,,,,0.0081159602850676,
STPAKNSDSEEMFDSDGEDEEEDK,ph,S,258,true,"srk2dei ABA signaling phopshoproteomics",83,23572148,"MASCOT Score",53.0000000,,,,,,-0.0001000
STPAKNSDSEEMFDSDGEDEEEDK,ph,S,258,true,"Brassinosteroid-Regulated Phosphorylation Dynamics",94,26187819,"MaxQuant Score",111.4500000,0.8480000,,,,6.927999720574E-7,2.1270000
STPAKNSDSEEMFDSDGEDEEEDKEVAVK,ph,S,260,true,"SnRK2 protein kinase substrates",85,23776212,XCorr,4.3539481,0.9970000,,,,0.0081159602850676,
STPAKNSDSEEMFDSDGEDEEEDK,ph,S,260,true,"srk2dei ABA signaling phopshoproteomics",83,23572148,"MASCOT Score",53.0000000,,,,,,-0.0001000
STPAKNSDSEEMFDSDGEDEEEDKEVAVK,ph,S,266,true,"Conserved plant phosphoproteome - Arabidopsis",61a,20466843,"MASCOT Score",40.0000000,1.0000000,,,,,
STPAKNSDSEEMFDSDGEDEEEDKEVAVK,ph,S,266,true,"SnRK2 protein kinase substrates",85,23776212,XCorr,4.3539481,1.0000000,,,,0.0081159602850676,
NSDSEEMFDSDGEDEEEDKEVAVKK,ph,S,266,true,"Phospho cell culture sucrose/TOR",109,30833711,,,1.0000000,,,,,
NSDSEEMFDSDGEDEEEDKEVAVKK,ph,S,266,true,"Tissue atlas Arabidopsis - ProteomicsDB",114,32188942,"MaxQuant score",177.9200000,1.0000000,,,,0,
STPAKNSDSEEMFDSDGEDEEEDK,ph,S,266,true,"Conserved plant phosphoproteome - Arabidopsis",61a,20466843,"MASCOT Score",39.0000000,0.7910806,,,,,
STPAKNSDSEEMFDSDGEDEEEDK,ph,S,266,true,"srk2dei ABA signaling phopshoproteomics",83,23572148,"MASCOT Score",53.0000000,,,,,,-0.0001000
STPAKNSDSEEMFDSDGEDEEEDK,ph,S,266,true,"Brassinosteroid-Regulated Phosphorylation Dynamics",94,26187819,"MaxQuant Score",111.4500000,1.0000000,,,,6.927999720574E-7,2.1270000
NSDSEEMFDSDGEDEEEDKEVAVK,ph,S,266,true,"SnRK2 protein kinase substrates",85,23776212,XCorr,2.0977693,0.9950000,,,,0.016732500866055,
NSDSEEMFDSDGEDEEEDK,ph,S,266,true,"Tyrosine phosphorylation in Arabidopsis",59,18463617,"MASCOT Score",88.0000000,,,,,,-1.0937429
NSDSEEMFDSDGEDEEEDK,ph,S,266,true,"TOR Kinase and ABA Receptor",100,29290610,XCorr,4.5198593,1.0000000,,,,1.286000070877E-7,
KLSKSEGTGKR,ub,K,288,true,"Arabidopsis ubiquitination COFRADIC",40,26744219,"MaxQuant Score",104.5900000,0.9990000,,,,3.0960001140556E-7,0.0520000
KLSKSEGTGKR,ub,K,291,true,"Arabidopsis ubiquitination COFRADIC",40,26744219,"MaxQuant Score",125.8200000,1.0000000,,,,2.3419999273244E-9,0.4440000
QTDSQSDSDAGEKAPSSEK,ph,S,316,true,"Tissue atlas Arabidopsis - ProteomicsDB",114,32188942,"MaxQuant score",154.3900000,0.9999670,,,,1.1867300340718E-21,
QTDSQSDSDAGEK,ph,S,316,true,"atm and atr DNA damage response",88,25561503,"MASCOT Score",58.0000000,1.0000000,,,,,-1.1500000
QTDSQSDSDAGEKAPSSEK,ph,S,318,true,"Tissue atlas Arabidopsis - ProteomicsDB",114,32188942,"MaxQuant score",162.9200000,0.9986060,,,,1.4305000444709E-22,
QTDSQSDSDAGEK,ph,S,318,true,"atm and atr DNA damage response",88,25561503,"MASCOT Score",75.0000000,1.0000000,,,,,0.5700000
QTDSQSDSDAGEKAPSSEK,ph,S,320,true,"Tissue atlas Arabidopsis - ProteomicsDB",114,32188942,"MaxQuant score",114.9000000,0.9994810,,,,4.9429998288941E-11,
KPETPTTGYGK,ph,T,338,true,"atm and atr DNA damage response",88,25561503,"MASCOT Score",38.0000000,1.0000000,,,,,-1.7500000
KPETPTTGYGK,ph,T,338,true,"Tissue atlas Arabidopsis - ProteomicsDB",114,32188942,"MaxQuant score",227.9500000,0.9999920,,,,1.4544076761227E-41,
SCGMSISPSVYR,ph,S,362,true,"Tyrosine phosphorylation in Arabidopsis",59,18463617,"MASCOT Score",46.0000000,,,,,,-1.5465022
SCGMSISPSVYR,ph,S,362,true,"Phospho cell culture sucrose/TOR",109,30833711,,,0.9669700,,,,,
SCGMSISPSVYR,ph,S,362,true,"Tissue atlas Arabidopsis - ProteomicsDB",114,32188942,"MaxQuant score",217.4600000,0.9997990,,,,1.495660501614E-39,
KAKQAPEEKR,ub,K,370,true,"Arabidopsis ubiquitination COFRADIC",40,26744219,"MaxQuant Score",102.4000000,1.0000000,,,,0.00066580000566319,-0.3730000
KAKQAPEEKR,ub,K,376,true,"Arabidopsis ubiquitination COFRADIC",40,26744219,"MaxQuant Score",53.5670000,1.0000000,,,,0.003000000026077,0.1240000
SSASFVPPPKPIK,ph,S,432,true,"atm and atr DNA damage response",88,25561503,"MASCOT Score",38.0000000,1.0000000,,,,,-1.5700000
