Peptide,PTM,ModifiedAA,ModifiedPosition,PeptideUniqueToGene,ExperimentDesc,ExpID,PubmedID,ScoreType,IdentScore,LocProb,Log2FChange,PQ-val,QuantSig,PEP,MassErrorPPM
MDHQNYQYQNPFER,nta,M,1,true,"Arabidopsis translation initiation landscape - NTA",167a,35069635,,,,,,,,
NGGGETPKYTPPAEK,ph,T,201,true,"Tissue atlas Arabidopsis - ProteomicsDB",114,32188942,"MaxQuant score",45.0690000,0.9694710,,,,0.0071268500760198,
YTPPAEKVLR,ac,K,210,true,"Histone deacetylases - apicidin vs control",98a,29061669,"MaxQuant Score",80.7000000,1.0000000,0.4850000,0.0466659,YES,0.0010000000474975,
YTPPAEKVLR,ac,K,210,true,"Histone deacetylases substrates - TSA vs control",98b,29061669,"MaxQuant Score",80.7000000,1.0000000,2.4160000,0.0194984,YES,0.0010000000474975,
YTPPAEKVLR,ac,K,210,true,"Histone deacetylases- hda14 vs WT (low light)",98c,29061669,"MaxQuant Score",102.5200000,1.0000000,-0.0280000,0.9931160,NO,0.0049999998882413,
YTPPAEKVLR,ac,K,210,true,"Histone deacetylases substrates - hda14 vs WT",98e,29061669,"MaxQuant Score",70.9000000,1.0000000,0.1190000,0.8912509,NO,0.00095000001601875,
YTPPAEKVLR,ac,K,210,true,"Quantitative Acetylproteomics",101,29440448,,,,,,,,
REHPGHLQEENADTPTLNK,ph,T,266,true,"TOR Kinase and ABA Receptor",100,29290610,XCorr,4.1864858,0.9971000,,,,0.00018299999646842,
EHPGHLQEENADTPTLNK,ph,T,266,true,"atm and atr DNA damage response",88,25561503,"MASCOT Score",51.0000000,1.0000000,,,,,-0.2300000
EHPGHLQEENADTPTLNK,ph,T,266,true,"Phospho cell culture sucrose/TOR",109,30833711,,,0.7845740,,,,,
EHPGHLQEENADTPTLNK,ph,T,266,true,"Tissue atlas Arabidopsis - ProteomicsDB",114,32188942,"MaxQuant score",211.6800000,0.9998580,,,,0,
HNGNDRNEIDDGSDQDVYRK,ph,S,284,true,"srk2dei ABA signaling phopshoproteomics",83,23572148,"MASCOT Score",62.0000000,,,,,,-0.0010000
HNGNDRNEIDDGSDQDVYRK,ph,S,284,true,"TOR Kinase and ABA Receptor",100,29290610,XCorr,4.2055526,0.9999000,,,,9.5960001544881E-7,
HNGNDRNEIDDGSDQDVYRK,ph,S,284,true,"Phospho cell culture sucrose/TOR",109,30833711,,,1.0000000,,,,,
HNGNDRNEIDDGSDQDVYR,ph,S,284,true,"atm and atr DNA damage response",88,25561503,"MASCOT Score",40.0000000,1.0000000,,,,,-0.3200000
NEIDDGSDQDVYRK,ph,S,284,true,"STN8 phosphoproteome",38,21768351,"MASCOT Score",59.7300000,,,,,,-0.7755670
NEIDDGSDQDVYRK,ph,S,284,true,"Chloroplast kinase substrates",60,19376835,"MASCOT Score",57.8700000,,,,,,-0.7755670
NEIDDGSDQDVYRK,ph,S,284,true,"srk2dei ABA signaling phopshoproteomics",83,23572148,"MASCOT Score",37.0000000,,,,,,0.0009000
NEIDDGSDQDVYRK,ph,S,284,true,"SnRK2 protein kinase substrates",85,23776212,XCorr,3.1529183,1.0000000,,,,0.0069739702157676,
NEIDDGSDQDVYRK,ph,S,284,true,"Tissue atlas Arabidopsis - ProteomicsDB",114,32188942,"MaxQuant score",252.8000000,1.0000000,,,,0,
NEIDDGSDQDVYR,ph,S,284,true,"STN8 phosphoproteome",38,21768351,"MASCOT Score",87.5100000,,,,,,-0.8019240
NEIDDGSDQDVYR,ph,S,284,true,"Chloroplast kinase substrates",60,19376835,"MASCOT Score",47.7800000,,,,,,-0.3911220
NEIDDGSDQDVYR,ph,S,284,true,"LAXIC - mannitol vs control",84b,23660473,XCorr,5.0300000,1.0000000,-1.2508626,,NO,8.8699998457287E-9,
NEIDDGSDQDVYR,ph,S,284,true,"atm and atr DNA damage response",88,25561503,"MASCOT Score",82.0000000,1.0000000,,,,,-0.0900000
FGENNEDDDDDEETEYED,ph,T,383,true,"STN8 phosphoproteome",38,21768351,"MASCOT Score",41.4400000,,,,,,-1.8544700
FGENNEDDDDDEETEYED,ph,T,383,true,"srk2dei ABA signaling phopshoproteomics",83,23572148,"MASCOT Score",46.0000000,,,,,,-0.0001000
FGENNEDDDDDEETEYED,ph,T,383,true,"atm and atr DNA damage response",88,25561503,"MASCOT Score",77.0000000,1.0000000,,,,,-1.0000000
FGENNEDDDDDEETEYED,ph,T,383,true,"TOR Kinase and ABA Receptor",100,29290610,XCorr,5.6315579,0.9933000,,,,5.7850002121995E-7,
FGENNEDDDDDEETEYED,ph,T,383,true,"Lateral root-induction - NAA vs control",106,23328941,"MASCOT Score",42.0000000,,,,,,
