Peptide,PTM,ModifiedAA,ModifiedPosition,PeptideUniqueToGene,ExperimentDesc,ExpID,PubmedID,ScoreType,IdentScore,LocProb,Log2FChange,PQ-val,QuantSig,PEP,MassErrorPPM
AQQNVSVPESSR,ng,N,52,true,"Conserved N-glycosylation",74,22633491,"MaxQuant Score",113.2100000,1.0000000,,,,6.965999688191E-8,0.5200000
EAIPIKVGGPPLPSGGLPGTDNSDQARDF,nt,E,83,true,"N-terminal ChaFRADIC",92,26010716,"MASCOT Score",28.3400000,,,,,3.7540000368739E-23,
EAIPIKVGGPPLPSGGLPGTDNSDQARD,nt,E,83,true,"HUNTER N-terminome: legumain, GluC and trypsin",119,31951383,"MaxQuant score",74.1300000,,,,,,
EAIPIKVGGPPLPSGGLPGTDNSDQAR,nt,E,83,true,"N-terminal ChaFRADIC",92,26010716,"MASCOT Score",38.4100000,,,,,4.4060000331352E-13,
EAIPIKVGGPPLPSGGLPGTDNSDQAR,nt,E,83,true,"Stromal N-terminome",96,26371235,"MASCOT Score",95.3900000,,,,,,
EAIPIKVGGPPLPSGGLPGTDNSDQAR,nt,E,83,true,"HUNTER N-terminome: legumain, GluC and trypsin",119,31951383,"MaxQuant score",172.3200000,,,,,,
EAIPIKVGGPPLPSGGLPGTDN,nt,E,83,true,"HUNTER N-terminome: legumain, GluC and trypsin",119,31951383,"MaxQuant score",176.3400000,,,,,,
EAIPIKVGGPPLPSGGLPGTD,nt,E,83,true,"N-terminal ChaFRADIC",92,26010716,"MASCOT Score",25.1500000,,,,,2.9879998621847E-14,
EAIPIKVGGPPLPSGGLPGTD,nt,E,83,true,"HUNTER N-terminome: legumain, GluC and trypsin",119,31951383,"MaxQuant score",240.2000000,,,,,,
EAIPIKVGGPPLPS,nt,E,83,true,"N-terminal ChaFRADIC",92,26010716,"MASCOT Score",21.0700000,,,,,3.2590000142996E-10,
EAIPIKVGGPPLPSGGLPGTDNSDQAR,nta,E,83,true,"Stromal N-terminome",96,26371235,"MASCOT Score",40.0000000,,,,,,
EAIPIKVGGPPLPSGGLPGTDNSDQAR,nta,E,83,true,"FtsH12 N-terminome: WT / FtsH12 knockdown miRNA",118,33216923,"MaxQuant score",64.5500000,,,,,0.015108999796212,
KVGGPPLPSGGLPGTDNSDQAR,nt,K,88,true,"Stromal N-terminome",96,26371235,"MASCOT Score",88.3400000,,,,,,
GGPPLPSGGLPGTDNSDQARDF,nt,G,90,true,"N-terminal ChaFRADIC",92,26010716,"MASCOT Score",55.6600000,,,,,6.3949999809521E-12,
GGPPLPSGGLPGTDNSDQAR,nt,G,90,true,"Tic56 chloroplast import - wild-type",89a,25588737,XCorr,4.2538157,,,,,,
GGPPLPSGGLPGTDNSDQAR,nt,G,90,true,"Tic56 chloroplast import - ppi2",89b,25588737,XCorr,4.3489194,,,,,,
GGPPLPSGGLPGTDNSDQAR,nt,G,90,true,"Stromal N-terminome",96,26371235,"MASCOT Score",113.1000000,,,,,,
GGPPLPSGGLPGTDNSDQAR,nt,G,90,true,"Arg/N-end rule seed, prt6 vs. Wt",99,29168982,"MASCOT Score",55.3900000,,-0.9291245,0.0608458,NO,0.00028969999402761,-2.4764999
GGPPLPSGGLPGTDNSDQAR,nt,G,90,true,"FtsH12 N-terminome: WT / FtsH12 knockdown miRNA",118,33216923,"MaxQuant score",98.9020000,,,,,3.7134409304608E-43,
GGPPLPSGGLPGTDNSDQAR,nt,G,90,true,"HUNTER N-terminome: legumain, GluC and trypsin",119,31951383,"MaxQuant score",87.0830000,,,,,,
GGPPLPSGGLPGTDNSDQAR,nta,G,90,true,"Stromal N-terminome",96,26371235,"MASCOT Score",54.6600000,,,,,,
GPPLPSGGLPGTDNSDQAR,nt,G,91,true,"Tic56 chloroplast import - wild-type",89a,25588737,XCorr,3.4019380,,,,,,
GPPLPSGGLPGTDNSDQAR,nt,G,91,true,"N-terminal ChaFRADIC",92,26010716,"MASCOT Score",22.7100000,,,,,7.9299998105853E-6,
GPPLPSGGLPGTDNSDQAR,nt,G,91,true,"Stromal N-terminome",96,26371235,"MASCOT Score",86.0800000,,,,,,
GLPGTDNSDQARDF,nt,G,98,false,"N-terminal ChaFRADIC",92,26010716,"MASCOT Score",60.4700000,,,,,6.1360001382127E-6,
DFSLALKDR,nt,D,110,true,"Metacaspase9 substrates - Col-0 / mc9",51a,23964026,"MASCOT Score",46.0000000,,,,,,-0.7427718
DFSLALKDR,nt,D,110,true,"Stromal N-terminome",96,26371235,"MASCOT Score",36.1100000,,,,,,
DFSLALKDR,nt,D,110,true,"HUNTER N-terminome: legumain, GluC and trypsin",119,31951383,"MaxQuant score",51.4450000,,,,,,
DFSLALKDR,ac,K,116,true,"Histone deacetylases - apicidin vs control",98a,29061669,"MaxQuant Score",102.5000000,1.0000000,-0.1510000,0.5248075,NO,0.0020000000949949,
DFSLALKDR,ac,K,116,true,"Histone deacetylases substrates - TSA vs control",98b,29061669,"MaxQuant Score",102.5000000,1.0000000,-0.0910000,0.9977001,NO,0.0020000000949949,
DFSLALKDR,ac,K,116,true,"Histone deacetylases - hda14 vs WT (thylakoids)",98d,29061669,"MaxQuant Score",157.7000000,1.0000000,0.3660000,0.8184648,NO,8.1200000336904E-14,
DFSLALKDR,ac,K,116,true,"Histone deacetylases substrates - hda14 vs WT",98e,29061669,"MaxQuant Score",66.1000000,1.0000000,-0.1770000,0.8912509,NO,0.0049999998882413,
DFSLALKDR,ac,K,116,true,"Quantitative Acetylproteomics",101,29440448,,,,,,,,
DFSLALKDR,ub,K,116,true,"Arabidopsis ubiquitination COFRADIC",40,26744219,"MaxQuant Score",67.7040000,1.0000000,,,,0.010999999940395,-0.3490000
DRFYIQPLSPTEAAAR,nt,D,117,true,"Tic56 chloroplast import - wild-type",89a,25588737,XCorr,3.0451055,,,,,,
DRFYIQPLSPTEAAAR,nt,D,117,true,"Stromal N-terminome",96,26371235,"MASCOT Score",44.5400000,,,,,,
RFYIQPLSPTEAAAR,nt,R,118,true,"Stromal N-terminome",96,26371235,"MASCOT Score",34.5400000,,,,,,
FYIQPLSPTEAAAR,nt,F,119,true,"Stromal N-terminome",96,26371235,"MASCOT Score",57.0100000,,,,,,
YIQPLSPTEAAAR,nt,Y,120,true,"Stromal N-terminome",96,26371235,"MASCOT Score",54.5600000,,,,,,
IQPLSPTEAAAR,nt,I,121,true,"Stromal N-terminome",96,26371235,"MASCOT Score",46.2800000,,,,,,
DRFYIQPLSPTEAAAR,ph,S,125,true,"srk2dei ABA signaling phopshoproteomics",83,23572148,"MASCOT Score",60.0000000,,,,,,0.0007000
DRFYIQPLSPTEAAAR,ph,S,125,true,"TOR Kinase and ABA Receptor",100,29290610,XCorr,3.8984048,0.9997000,,,,4.6989998736535E-6,
FYIQPLSPTEAAAR,ph,S,125,true,"STN8 phosphoproteome",38,21768351,"MASCOT Score",50.6000000,,,,,,-1.7864800
FYIQPLSPTEAAAR,ph,S,125,true,"Large-scale phosphorylation discovery",44,23111157,XCorr,4.3150000,,,,,,
FYIQPLSPTEAAAR,ph,S,125,true,"Chloroplast kinase substrates",60,19376835,"MASCOT Score",53.3000000,,,,,,-1.1906600
FYIQPLSPTEAAAR,ph,S,125,true,"srk2dei ABA signaling phopshoproteomics",83,23572148,"MASCOT Score",59.0000000,,,,,,0.0004000
FYIQPLSPTEAAAR,ph,S,125,true,"LAXIC - ABA stress",84a,23660473,XCorr,4.0400000,0.9670000,,,,2.479999920979E-7,
FYIQPLSPTEAAAR,ph,S,125,true,"LAXIC - mannitol vs control",84b,23660473,XCorr,3.5900000,0.9980000,,,,9.4299998365521E-11,
FYIQPLSPTEAAAR,ph,S,125,true,"SnRK2 protein kinase substrates",85,23776212,XCorr,3.9602346,1.0000000,,,,3.1472500268137E-6,
FYIQPLSPTEAAAR,ph,S,125,true,"atm and atr DNA damage response",88,25561503,"MASCOT Score",62.0000000,1.0000000,,,,,-0.0200000
FYIQPLSPTEAAAR,ph,S,125,true,"TOR Kinase and ABA Receptor",100,29290610,XCorr,4.1545525,0.9998000,,,,9.6609994670871E-7,
FYIQPLSPTEAAAR,ph,S,125,true,"Tissue atlas Arabidopsis - ProteomicsDB",114,32188942,"MaxQuant score",212.1700000,0.9985240,,,,5.3949990876505E-43,
FYIQPLSPTEAAAR,ph,S,125,true,"Touch-induced phosphorylation: 40s touch vs untouc",136,30291188,"MASCOT score",62.9100000,,0.2038051,0.7144638,NO,,6.4723799
DRFYIQPLSPTEAAAR,ph,T,127,true,"srk2dei ABA signaling phopshoproteomics",83,23572148,"MASCOT Score",57.0000000,,,,,,-0.0003000
FYIQPLSPTEAAAR,ph,T,127,true,"srk2dei ABA signaling phopshoproteomics",83,23572148,"MASCOT Score",39.0000000,,,,,,0.0001000
DSAKEIINVK,ac,K,138,true,"Histone deacetylases - apicidin vs control",98a,29061669,"MaxQuant Score",61.3000000,1.0000000,0.0060000,0.9840111,NO,0.0049999998882413,
DSAKEIINVK,ac,K,138,true,"Histone deacetylases substrates - TSA vs control",98b,29061669,"MaxQuant Score",61.3000000,1.0000000,-0.0800000,0.9977001,NO,0.0049999998882413,
DSAKEIINVK,ac,K,138,true,"Histone deacetylases - hda14 vs WT (thylakoids)",98d,29061669,"MaxQuant Score",104.1000000,1.0000000,0.2280000,0.9571941,NO,0.00071300001582131,
EIINVKSFIDKK,ac,K,144,true,"Quantitative Acetylproteomics",101,29440448,,,,,,,,
EIINVKSFIDK,ac,K,144,true,"Histone deacetylases - hda14 vs WT (thylakoids)",98d,29061669,"MaxQuant Score",94.1000000,1.0000000,0.4100000,0.8394600,NO,7.8600001870655E-5,
EIINVKSFIDK,ac,K,144,true,"Quantitative Acetylproteomics",101,29440448,,,,,,,,
EIINVKSFIDKK,cr,K,144,true,"Open search Plant PTM Viewer 2.0 - Crotonylation",164c,TBA,,,,,,,,
YDLNTVISAKPK,cr,K,177,true,"Open search Plant PTM Viewer 2.0 - Crotonylation",164c,TBA,,,,,,,,
YDLNTVISAKPKEEK,ac,K,179,true,"Quantitative Acetylproteomics",101,29440448,,,,,,,,
EEKQSLK,ac,K,182,true,"Histone deacetylases substrates - hda14 vs WT",98e,29061669,"MaxQuant Score",109.7000000,1.0000000,-0.1210000,0.9099133,NO,0.00036000000545755,
QSLKDLTAK,ac,K,186,true,"Histone deacetylases - hda14 vs WT (thylakoids)",98d,29061669,"MaxQuant Score",105.5000000,1.0000000,0.2380000,0.8550667,NO,0.010999999940395,
DLTAKLFQTIDNLDYAAR,ac,K,191,true,"Histone deacetylases - hda14 vs WT (thylakoids)",98d,29061669,"MaxQuant Score",56.8000000,1.0000000,0.9010000,0.4335109,NO,5.2799998229602E-5,
FQTIDNLDYAAR,nt,F,193,true,"Stromal N-terminome",96,26371235,"MASCOT Score",62.8100000,,,,,,
QTIDNLDYAAR,nt,Q,194,true,"Stromal N-terminome",96,26371235,"MASCOT Score",36.4900000,,,,,,
SKSSPDAEKYYSETVSSLNNVLAK,ac,K,206,true,"Quantitative Acetylproteomics",101,29440448,,,,,,,,
SKSSPDAEK,ac,K,206,true,"Quantitative Acetylproteomics",101,29440448,,,,,,,,
