Peptide,PTM,ModifiedAA,ModifiedPosition,PeptideUniqueToGene,ExperimentDesc,ExpID,PubmedID,ScoreType,IdentScore,LocProb,Log2FChange,PQ-val,QuantSig,PEP,MassErrorPPM
SGTVKDIVSKAELDNLR,nt,S,2,true,"Stromal N-terminome",96,26371235,"MASCOT Score",37.2700000,,,,,,
SGTVKDIVSK,nt,S,2,false,"N-term acetylation drought responses",5,26184543,,,,,,,,
SGTVKDIVSKAELDNLRQSGAPVVL,nta,S,2,true,"Arabidopsis translation initiation landscape - NTA",167a,35069635,,,,,,,,
SGTVKDIVSKAELDNLR,nta,S,2,true,"Arg/N-end rule pathway Roots",80,25728785,"MASCOT Score",42.5500000,,,,,5.1260001782794E-5,
SGTVKDIVSKAELDNLR,nta,S,2,true,"Stromal N-terminome",96,26371235,"MASCOT Score",37.2700000,,,,,,
SGTVKDIVSKAELDNLR,nta,S,2,true,"HUNTER N-terminome: legumain, GluC and trypsin",119,31951383,"MaxQuant score",56.8510000,,,,,,
SGTVKDIVSK,nta,S,2,false,"N-term acetylation drought responses",5,26184543,,,,,,,,
SGTVKDIVSK,ph,S,2,false,"Tissue atlas Arabidopsis - ProteomicsDB",114,32188942,"MaxQuant score",119.7400000,0.7697390,,,,3.2608000765322E-5,
VAGSSTSAEPAAPASLGLAAGPTILETVK,ph,S,119,true,"TOR Kinase and ABA Receptor",100,29290610,XCorr,3.6555197,0.8071000,,,,6.3029998273123E-5,
AQPVSTADALK,ph,S,148,false,"Tissue atlas Arabidopsis - ProteomicsDB",114,32188942,"MaxQuant score",73.8810000,0.8122840,,,,0.0021101799793541,
AQPVSTADALK,ph,T,149,false,"Tissue atlas Arabidopsis - ProteomicsDB",114,32188942,"MaxQuant score",81.6760000,0.7805940,,,,0.0028588399291039,
AQPVSTADALKSR,ac,K,154,true,"Quantitative Acetylproteomics",101,29440448,,,,,,,,
AQPVSTADALKSR,ub,K,154,true,"Arabidopsis ubiquitination COFRADIC",40,26744219,"MaxQuant Score",49.1490000,1.0000000,,,,0.00090300000738353,-0.0090000
AQPVSTADALKSR,ub,K,154,true,"upl3 mutant / wildtype",168,35926874,"MaxQuant score",88.0750000,1.0000000,-0.9601597,0.3679000,NO,1.9366199921933E-5,3.3685000
DLGITTVGSKESQDEAGK,ph,S,262,true,"Tissue atlas Arabidopsis - ProteomicsDB",114,32188942,"MaxQuant score",116.7900000,0.9585060,,,,7.6073597421455E-10,
GGGVSSGNTGLSETLR,ph,S,273,true,"Tissue atlas Arabidopsis - ProteomicsDB",114,32188942,"MaxQuant score",197.7000000,0.9970130,,,,6.4078102649868E-36,
GGGVSSGNTGLSETLR,ph,S,274,true,"Tissue atlas Arabidopsis - ProteomicsDB",114,32188942,"MaxQuant score",58.1590000,0.7786610,,,,0.001512169954367,
CGFSGK,ox,C,309,true,"OxiTRAQ Arabidopsis - 5 mM H2O2 versus control",47,24376095,,,,0.4522950,0.0576297,NO,,
